{"text_format":"1","workbook":"xlsx","n_sheets":5,"sheets":["Premissas","Densidade e Viscosidade do CO2","Dados de Entrada","Fluxo de Caixa","Resultados"],"not_rendered":{"charts":0,"images":0,"macros":1,"external_links":0,"defined_names":0,"comments":0,"pivot_tables":0},"unopened":[],"bounds":{"document_bytes":16777216,"sheet_cells":100000,"rows_first":2000,"rows_last":500,"rows_between":2000,"halvings":0,"cell_chars":16384,"cell_head_chars":4096},"cells_cut":0,"cells_raw":0,"read":"whole","date_system":"1900"}

{"sheet":"Premissas","index":0,"n_rows":55,"n_cols":10,"rows_kept":55,"cut":false,"hidden":false,"merged":[[27,0,27,2],[28,0,28,1],[37,0,37,2],[43,0,43,2],[0,0,0,9],[10,0,10,4],[17,0,17,4]]}
["Informações Relevantes sobre os combustíveis utilizados no modelo"]
["Combustível","Unidade comercial\n(S.I.)","Densidade\n(kg/m³)","Poder calorífico inferior\n(kcal/kg)","Poder calorífico inferior\n(kcal/S.I.)","Intensidade de Carbono\nEmissões da Cadeia de Suprimento\n(gCO2eq/MJ)","Intensidade de Carbono\nEmissões Biogênicas da Queima\n(gCO2eq/MJ)","Intensidade de Carbono\nEmissões não-Biogênicas da Queima \n(gCO2eq/MJ)","Intensidade de Carbono\nEmissões totais\n(gCO2eq/MJ)","Intensidade de Carbono\nEmissões totais\n(gCO2eq/S.I)"]
["Hidrogênio","kg",8.3752093802345065E-2,28632.139199999994,{"$f":"D3","v":28632.139199999994},{"$f":"E26","v":33.411953163702854},0,0,{"$f":"F3+H3+G3","v":33.411953163702854},{"$f":"I3*(E3*D14/10^3)","v":4005.3260593336486}]
["Etanol","Litros",791,6750,{"$f":"D4*C4/10^3","v":5339.25},21.95,68.260000000000005,0.44,{"$f":"F4+H4+G4","v":90.65},{"$f":"I4*(E4*$D$14/10^3)","v":2026.4238127349997}]
["Gás Natural","m³",0.74,11891.891891891892,{"$f":"D5*C5","v":8800},19.04,0,57.81,{"$f":"F5+H5+G5","v":76.849999999999994},{"$f":"I5*(E5*$D$14/10^3)","v":2831.4491039999994}]
["Óleo combustível","kg",1000,9590,{"$f":"D6","v":9590},12.07,0,77.796000000000006,{"$f":"F6+H6+G6","v":89.866000000000014},{"$f":"I6*(E6*$D$14/10^3)","v":3608.246790792}]
["GLP","kg",552,11100,{"$f":"D7","v":11100},15.6,0,64.599999999999994,80.199999999999989,{"$f":"I7*(E7*$D$14/10^3)","v":3727.1730959999991}]
["Diesel B (B15)","Litros",846,9928.3687943262412,{"$f":"D8*C8/10^3","v":8399.4},13.203360387017639,0,63.965943986747355,77.169304373764987,{"$f":"I8*(E8*$D$14/10^3)","v":2713.782670371334}]
["Eletricidade","kWh",{"$f":"NA()","v":{"$error":"#N/A"}},{"$f":"NA()","v":{"$error":"#N/A"}},{"$f":"NA()","v":{"$error":"#N/A"}},20.85,0,0,20.85,{"$f":"I9*D16/10^6","v":75.06}]
[]
["Tabela de Fatores de Conversão para Energia"]
[null,"British Thermal Unit","Caloria","Joule","Quilowatt-hora"]
["British Thermal Unit",1,252,1055,{"$f":"1/B16","v":2.9308323563892143E-4}]
["Caloria",{"$f":"1/C13","v":3.968253968253968E-3},1,4.1867999999999999,{"$f":"1/C16","v":1.1627906976744186E-6}]
["Joule",{"$f":"1/D13","v":9.4786729857819908E-4},{"$f":"1/D14","v":0.23884589662749595},1,{"$f":"1/D16","v":2.7777777777777776E-7}]
["Quilowatt-hora (kWh)",3412,860000,3600000,1]
[]
["Intensidade de Carbono da Produção do Hidrogênio Musgo (gCO2eq/MJ)"]
[null,"Etanol","Gás Natural","Eletricidade","Total"]
["Emissão da Reforma a Vapor do Etanol",{"$f":"'Dados de Entrada'!$B$30*10^3*'Dados de Entrada'!B44*(E4*D14/10^3)*($F$4+$H$4)/('Dados de Entrada'!$B$30*10^3*$D$3*($D$14/10^3))","v":31.940520440575391},0,{"$f":"'Dados de Entrada'!$B$30*10^3*'Dados de Entrada'!B42*(D16/10^6)*$I$9/('Dados de Entrada'!$B$30*10^3*$D$3*($D$14/10^3))","v":1.4714327231274651},{"$f":"SUM(B20:D20)","v":33.411953163702854}]
["Emissão do CCS (sem estocagem)",0,{"$f":"'Dados de Entrada'!$B$57*'Dados de Entrada'!B64*(C5*D5*D14/10^3)*$I$5/('Dados de Entrada'!$B$30*10^3*$D$3*($D$14/10^3))","v":0},{"$f":"('Dados de Entrada'!$B$57*'Dados de Entrada'!B65+'Dados de Entrada'!B90)*(D16/10^6)*$I$9/('Dados de Entrada'!$B$30*10^3*$D$3*($D$14/10^3))","v":0},{"$f":"SUM(B21:D21)","v":0}]
["Emissão Total",{"$f":"SUM(B20:B21)","v":31.940520440575391},{"$f":"SUM(C20:C21)","v":0},1.4714327231274651,{"$f":"SUM(B22:D22)","v":33.411953163702854}]
[]
["Emissão Total",null,null,null,{"$f":"E22","v":33.411953163702854}]
["Emissão evitada com a Captura de CO2",null,null,null,{"$f":"'Dados de Entrada'!B57*10^6/('Dados de Entrada'!$B$30*10^3*$D$3*($D$14/10^3))","v":0}]
["Emissão efetiva",null,null,null,{"$f":"E22-E25","v":33.411953163702854}]
[]
["Tabela de constantes dos modelos de vazão de gasodutos"]
["Escolha do modelo",null,"Panhandle-B"]
["Variável","Valor","Unidade"]
["η",{"$f":"IF($C$29=\"Panhandle-B\",1,1)","v":1},"Constante"]
["C1",{"$f":"IF($C$29=\"Panhandle-B\",137.24,88.06)","v":137.24},"Constante"]
["C2",{"$f":"IF($C$29=\"Panhandle-B\",1,1)","v":1},"Constante"]
["a",{"$f":"IF($C$29=\"Panhandle-B\",0.9608,0.8)","v":0.96079999999999999},"Constante"]
["b",{"$f":"IF($C$29=\"Panhandle-B\",0.51,0.5555)","v":0.51},"Constante"]
["c",{"$f":"IF($C$29=\"Panhandle-B\",2.53,2.6667)","v":2.5299999999999998},"Constante"]
[]
["Tabela de propriedades físicas do CO2"]
["Variável","Valor","Unidade"]
["Viscosidade (31ºC a 74 bar)",4.0738000000000002E-5,"Pa*s"]
["Densidade (31°C a 74 bar)",565.95000000000005,"kg/m³"]
["Massa molar",4.40095E-2,"kg/mol"]
[]
["Tabela de propriedades físicas de outros componentes"]
["Variável","Valor","Unidade"]
["Constante dos gases ideais (R_gases ideais)",8.3140000000000001,"J/(K·mol) "]
["Massa molar do ar (M_ar)",2.8965000000000001E-2,"kg/mol"]
["Constante do ar (R_ar)",{"$f":"B46/B47","v":287.03607802520281},"J/(kg.K)"]
["Temperatura padrão (31ºC)",{"$f":"31+273.15","v":304.14999999999998}," Kelvin"]
["Pressão Padrão",74,"bar"]
["Constante Gravitacional Universal (G)",9.8066499999999994,"m/s²"]
["exponente politrópico/isentrópico (k)",{"$f":"SUMIFS('Densidade e Viscosidade do CO2'!$G:$G,'Densidade e Viscosidade do CO2'!$A:$A,'Dados de Entrada'!$B$74,'Densidade e Viscosidade do CO2'!$B:$B,'Dados de Entrada'!$B$72)","v":3.2908833848248418},"Adimensional"]
["n_stage",1,"Unidades"]
["Polegadas por Metro",39.370100000000001,"polegadas/metro"]
["Pressão inicial do duto máxima permitida ",200,"Bars"]

{"sheet":"Densidade e Viscosidade do CO2","index":1,"n_rows":2541,"n_cols":7,"rows_kept":2541,"cut":false,"hidden":false,"merged":[]}
["Temperature (Celsus)","Pressure (bar)","Density (kg/m3)","Viscosity (Pa*s)","Cv (J/g*K)","Cp (J/g*K)","K = Cp/Cv"]
[31,74,565.95000000000005,4.0738000000000002E-5,1.4588000000000001,47.393000000000001,{"$f":"F2/E2","v":32.48766109130792}]
[31,75,614.16999999999996,4.5670999999999997E-5,1.1909000000000001,14.737,{"$f":"F3/E3","v":12.374674615836762}]
[31,76,635.51,4.8050999999999998E-5,1.1335999999999999,10.419,{"$f":"F4/E4","v":9.1910726887791121}]
[31,77,650.30999999999995,4.9778999999999999E-5,1.1035999999999999,8.5045999999999999,{"$f":"F5/E5","v":7.7062341428053651}]
[31,78,661.88,5.1174999999999997E-5,1.0831999999999999,7.3833000000000002,6.816192762186116]
[31,79,671.47,5.2364999999999998E-5,1.0676000000000001,6.6329000000000002,6.2129074559760209]
[31,80,679.73,5.3412999999999998E-5,1.0549999999999999,6.0894000000000004,5.7719431279620856]
[31,81,687,5.4354000000000002E-5,1.0444,5.6744000000000003,5.4331673688242059]
[31,82,693.52,5.5213999999999997E-5,1.0353000000000001,5.3453999999999997,5.1631411185163714]
[31,83,699.45,5.6008000000000003E-5,1.0273000000000001,5.077,4.9420811836853886]
[31,84,704.9,5.6749000000000002E-5,1.0203,4.8529999999999998,4.7564441830834063]
[31,85,709.94,5.7445000000000003E-5,1.014,4.6627000000000001,4.5983234714003949]
[31,86,714.65,5.8102E-5,1.0084,4.4985999999999997,4.4611265370884565]
[31,87,719.06,5.8727000000000002E-5,1.0033000000000001,4.3552999999999997,4.3409747832153887]
[31,88,723.23,5.9321999999999999E-5,0.99865999999999999,4.2287999999999997,4.234474195421865]
[31,89,727.17,5.9892000000000002E-5,0.99443999999999999,4.1162000000000001,4.1392140300068379]
[31,90,730.91,6.0439999999999997E-5,0.99058000000000002,4.0149999999999997,4.0531809646873542]
[31,91,734.49,6.0967000000000001E-5,0.98702000000000001,3.9236,3.9751980709610746]
[31,92,737.9,6.1476000000000006E-5,0.98373999999999995,3.8403999999999998,3.9038770406814809]
[31,93,741.17,6.1968E-5,0.98068999999999995,3.7643,3.8384198880380143]
[31,94,744.32,6.2445000000000003E-5,0.97787000000000002,3.6943999999999999,3.7780073015840552]
[31,95,747.34,6.2909000000000004E-5,0.97523000000000004,3.6297999999999999,3.721993786081232]
[31,96,750.26,6.3359000000000001E-5,0.97277000000000002,3.57,3.6699322553121494]
[31,97,753.08,6.3798000000000001E-5,0.97047000000000005,3.5143,3.6212350716663058]
[31,98,755.81,6.4225000000000003E-5,0.96831,3.4622999999999999,3.5756111162747466]
[31,99,758.45,6.4641999999999995E-5,0.96626999999999996,3.4136000000000002,3.5327599946184818]
[31,100,761.01,6.5049999999999996E-5,0.96435999999999999,3.3679000000000001,3.492367995354432]
[31,101,763.5,6.5448000000000001E-5,0.96255000000000002,3.3249,3.4542621162537008]
[31,102,765.91,6.5839000000000004E-5,0.96084000000000003,3.2843,3.4181549477540485]
[31,103,768.27,6.6221000000000002E-5,0.95923000000000003,3.2458999999999998,3.3838599710184205]
[31,104,770.56,6.6595999999999997E-5,0.95769000000000004,3.2096,3.3513976338898805]
[31,105,772.79,6.6963000000000002E-5,0.95623000000000002,3.1751,3.3204354600880541]
[31,106,774.97,6.7323999999999994E-5,0.95484999999999998,3.1423000000000001,3.2908833848248418]
[31,107,777.1,6.7679E-5,0.95352999999999999,3.1110000000000002,3.2626136566232842]
[31,108,779.17,6.8027000000000004E-5,0.95226999999999995,3.0811999999999999,3.2356369517048735]
[31,109,781.2,6.8369999999999998E-5,0.95106999999999997,3.0528,3.2098583700463688]
[31,110,783.19,6.8707000000000005E-5,0.94991999999999999,3.0255000000000001,3.1850050530570995]
[31,111,785.14,6.9039000000000001E-5,0.94882,2.9994000000000001,3.1611896882443458]
[31,112,787.04,6.9366E-5,0.94777,2.9744000000000002,3.1383141479472871]
[31,113,788.91,6.9689000000000003E-5,0.94676000000000005,2.9504000000000001,3.1163124762347376]
[31,114,790.74,7.0005999999999993E-5,0.94579999999999997,2.9274,3.0951575385916685]
[31,115,792.53,7.0320000000000004E-5,0.94486999999999999,2.9051999999999998,3.0747086900843499]
[31,116,794.3,7.0629000000000004E-5,0.94398000000000004,2.8837999999999999,3.054937604610267]
[31,117,796.03,7.0933999999999995E-5,0.94311999999999996,2.8632,3.0358809059292562]
[31,118,797.73,7.1235000000000005E-5,0.94228999999999996,2.8433999999999999,3.0175423701832771]
[31,119,799.39,7.1532000000000006E-5,0.9415,2.8241999999999998,2.9996813595326604]
[31,120,801.04,7.1826E-5,0.94072999999999996,2.8056999999999999,2.9824710597089492]
[31,121,802.65,7.2115999999999999E-5,0.93998999999999999,2.7877999999999998,2.9657762316620389]
[31,122,804.24,7.2403000000000005E-5,0.93928,2.7705000000000002,2.9495996933821651]
[31,123,805.8,7.2686000000000002E-5,0.93859000000000004,2.7538,2.9339754312319544]
[31,124,807.33,7.2966000000000006E-5,0.93793000000000004,2.7374999999999998,2.9186613073470298]
[31,125,808.85,7.3244000000000005E-5,0.93728999999999996,2.7218,2.9039038077862775]
[31,126,810.34,7.3517999999999996E-5,0.93667,2.7065000000000001,2.889491496471543]
[31,127,811.81,7.3789999999999997E-5,0.93606999999999996,2.6917,2.8755328127169979]
[31,128,813.25,7.4059000000000004E-5,0.93547999999999998,2.6772999999999998,2.8619532218754009]
[31,129,814.68,7.4325000000000004E-5,0.93491999999999997,2.6633,2.8486929362940145]
[31,130,816.09,7.4587999999999998E-5,0.93437999999999999,2.6497999999999999,2.8358911791776364]
[31,131,817.47,7.4849000000000001E-5,0.93384999999999996,2.6364999999999998,2.8232585533008514]
[31,132,818.84,7.5108E-5,0.93333999999999995,2.6236999999999999,2.8110870636638312]
[31,133,820.19,7.5364000000000006E-5,0.93284,2.6112000000000002,2.7991938596115093]
[31,134,821.53,7.5617999999999993E-5,0.93235999999999997,2.5990000000000002,2.7875498734394442]
[31,135,822.84,7.5870000000000004E-5,0.93189,2.5871,2.7761860305400852]
[31,136,824.14,7.6118999999999994E-5,0.93144000000000005,2.5756000000000001,2.7651807953276646]
[31,137,825.42,7.6366999999999996E-5,0.93100000000000005,2.5642999999999998,2.754350161117078]
[31,138,826.69,7.6612000000000004E-5,0.93057000000000001,2.5533000000000001,2.7438021857571169]
[31,139,827.94,7.6854999999999995E-5,0.93015000000000003,2.5425,{"$f":"F67/E67","v":2.733430091920658}]
[31,140,829.18,7.7095999999999995E-5,0.92974999999999997,2.5320999999999998,2.723420274267276]
[31,141,830.4,7.7336000000000006E-5,0.92935999999999996,2.5217999999999998,2.713480244469312]
[31,142,831.61,7.7572999999999997E-5,0.92898000000000003,2.5118,2.7038257013068097]
[31,143,832.8,7.7809E-5,0.92859999999999998,2.5021,2.6944863234977388]
[31,144,833.98,7.8042999999999998E-5,0.92823999999999995,2.4925000000000002,2.6851891752133072]
[31,145,835.15,7.8275000000000005E-5,0.92788999999999999,2.4832000000000001,2.6761792884932483]
[31,146,836.31,7.8505999999999997E-5,0.92754999999999999,2.4740000000000002,2.6672416581316374]
[31,147,837.45,7.8734999999999997E-5,0.92722000000000004,2.4651000000000001,2.6585923513297813]
[31,148,838.58,7.8961999999999994E-5,0.92688999999999999,2.4563999999999999,2.6501526610493156]
[31,149,839.7,7.9188000000000001E-5,0.92657999999999996,2.4478,2.6417578622461093]
[31,150,840.81,7.9412000000000005E-5,0.92627000000000004,2.4394,2.6335733641378862]
[31,151,841.9,7.9635000000000006E-5,0.92596999999999996,2.4312,2.6255710228193139]
[31,152,842.99,7.9856000000000003E-5,0.92567999999999995,2.4230999999999998,2.6176432460461498]
[31,153,844.06,8.0075999999999997E-5,0.9254,2.4152999999999998,2.6100064836827315]
[31,154,845.13,8.0294000000000001E-5,0.92512000000000005,2.4075000000000002,2.6023650985818056]
[31,155,846.18,8.0511000000000002E-5,0.92484999999999995,2.4,2.5950154079039844]
[31,156,847.22,8.0727000000000001E-5,0.92459000000000002,2.3925000000000001,2.5876334375236589]
[31,157,848.26,8.0940999999999996E-5,0.92432999999999998,2.3852000000000002,2.5804636872112776]
[31,158,849.28,8.1154000000000003E-5,0.92408000000000001,2.3780999999999999,2.5734784867111071]
[31,159,850.3,8.1366000000000007E-5,0.92383999999999999,2.3711000000000002,2.566569968825771]
[31,160,851.3,8.1576000000000006E-5,0.92359999999999998,2.3641999999999999,2.5597661325249024]
[31,161,852.3,8.1785000000000004E-5,0.92337000000000002,2.3574000000000002,2.553039409987329]
[31,162,853.28,8.1994000000000001E-5,0.92313999999999996,2.3508,2.5465259873908619]
[31,163,854.26,8.2200000000000006E-5,0.92291999999999996,2.3441999999999998,2.5399817969054737]
[31,164,855.23,8.2405999999999997E-5,0.92271000000000003,2.3378000000000001,2.5336237821200593]
[31,165,856.2,8.2610999999999999E-5,0.92249999999999999,2.3315000000000001,2.5273712737127374]
[31,166,857.15,8.2813999999999997E-5,0.92229000000000005,2.3252999999999999,2.5212243437530493]
[31,167,858.1,8.3016999999999995E-5,0.92208999999999997,2.3191999999999999,2.5151557873960244]
[31,168,859.03,8.3218000000000002E-5,0.92190000000000005,2.3132999999999999,2.5092743247640739]
[31,169,859.96,8.3418999999999995E-5,0.92171000000000003,2.3073999999999999,2.5033904373392932]
[31,170,860.89,8.3617999999999998E-5,0.92152000000000001,2.3016000000000001,2.4976126399861101]
[31,171,861.8,8.3815999999999998E-5,0.92134000000000005,2.2959000000000001,2.491913951418586]
[31,172,862.71,8.4012999999999997E-5,0.92115999999999998,2.2902999999999998,2.4863215945112684]
[31,173,863.61,8.4209999999999995E-5,0.92098999999999998,2.2848000000000002,2.4808086949912598]
[31,174,864.51,8.4405000000000002E-5,0.92081999999999997,2.2793999999999999,2.4754023587671856]
[31,175,865.39,8.4599999999999996E-5,0.92066000000000003,2.274,2.4699671974453108]
[31,176,866.27,8.4792999999999999E-5,0.92049999999999998,2.2688000000000001,2.4647474198804997]
[31,177,867.15,8.4986000000000003E-5,0.92034000000000005,2.2635999999999998,2.4595258274116083]
[31,178,868.01,8.5177000000000001E-5,0.92018999999999995,2.2585000000000002,2.4543844206087875]
[31,179,868.87,8.5368E-5,0.92003999999999997,2.2534999999999998,2.4493500282596408]
[31,180,869.73,8.5557999999999996E-5,0.91988999999999999,2.2484999999999999,2.4443139940645078]
[31,181,870.58,8.5747000000000004E-5,0.91974999999999996,2.2437,2.4394672465343845]
[31,182,871.42,8.5934999999999996E-5,0.91961000000000004,2.2389000000000001,2.4346190232816087]
[31,183,872.25,8.6123000000000002E-5,0.91947999999999996,2.2341000000000002,2.4297428981598297]
[31,184,873.08,8.6309000000000003E-5,0.91934000000000005,2.2294999999999998,2.4251093175538969]
[31,185,873.91,8.6495000000000004E-5,0.91920999999999997,2.2248999999999999,2.4204479933856247]
[31,186,874.73,8.6680000000000004E-5,0.91908999999999996,2.2204000000000002,2.4158678693055089]
[31,187,875.54,8.6865000000000003E-5,0.91896,2.2159,2.4113127883694609]
[31,188,876.35,8.7047999999999997E-5,0.91883999999999999,2.2115,2.4068390579426233]
[31,189,877.15,8.7231000000000006E-5,0.91873000000000005,2.2071000000000001,2.4023380100791307]
[31,190,877.94,8.7412999999999998E-5,0.91861000000000004,2.2029000000000001,2.3980797073839821]
[31,191,878.73,8.7594000000000002E-5,0.91849999999999998,2.1985999999999999,2.3936853565596081]
[31,192,879.52,8.7775000000000006E-5,0.91839000000000004,2.1945000000000001,2.389507725476105]
[31,193,880.3,8.7954999999999994E-5,0.91827999999999999,2.1903000000000001,2.3852201942762559]
[31,194,881.08,8.8133999999999993E-5,0.91818,2.1863000000000001,2.3811235269772815]
[31,195,881.85,8.8312000000000004E-5,0.91808000000000001,2.1823000000000001,2.377025967235971]
[31,196,882.61,8.8490000000000001E-5,0.91798000000000002,2.1783000000000001,2.3729275147606703]
[31,197,883.37,8.8666999999999997E-5,0.91788000000000003,2.1743999999999999,2.3689371159628707]
[31,198,884.13,8.8844000000000005E-5,0.91778999999999999,2.1705999999999999,2.3650290371435729]
[31,199,884.88,8.9018999999999996E-5,0.91769000000000001,2.1667999999999998,2.3611459207357601]
[31,200,885.63,8.9195000000000002E-5,0.91759999999999997,2.1629999999999998,2.3572362685265911]
[32,74,314.99,2.3136999999999999E-5,1.2448999999999999,14.313000000000001,11.497309020804886]
[32,75,365.93,2.5772999999999999E-5,1.4158999999999999,37.606000000000002,26.559785295571725]
[32,76,557.5,3.998E-5,1.3429,34.664000000000001,{"$f":"F131/E131","v":25.812793208727381}]
[32,77,601.73,4.4385999999999998E-5,1.1876,15.077999999999999,12.696194004715393]
[32,78,624.17999999999995,4.6814999999999998E-5,1.1373,10.785,9.4829860195199167]
[32,79,639.87,4.8596E-5,1.1085,8.7904999999999998,7.9300857013982853]
[32,80,652.12,5.0036E-5,1.0880000000000001,7.6093999999999999,6.9939338235294111]
[32,81,662.26,5.1261999999999998E-5,1.0720000000000001,6.8169000000000004,6.3590485074626866]
[32,82,670.95,5.2339000000000002E-5,1.0589,6.2430000000000003,5.8957408631598831]
[32,83,678.59,5.3306000000000001E-5,1.0478000000000001,5.8051000000000004,5.5402748616148116]
[32,84,685.42,5.4187000000000001E-5,1.0383,5.4584000000000001,5.2570548011172109]
[32,85,691.62,5.4999E-5,1.0299,5.1759000000000004,5.0256335566559862]
[32,86,697.31,5.5755999999999999E-5,1.0226,4.9404000000000003,4.8312145511441429]
[32,87,702.56,5.6465999999999998E-5,1.016,4.7407000000000004,4.6660433070866141]
[32,88,707.45,5.7136000000000003E-5,1.0102,4.5686999999999998,4.5225697881607605]
[32,89,712.04,5.7772000000000002E-5,1.0048999999999999,4.4188000000000001,4.3972534580555287]
[32,90,716.36,5.8378000000000002E-5,1.0001,4.2866,4.2861713828617143]
[32,91,720.44,5.8956999999999998E-5,0.99572000000000005,4.1691000000000003,4.1870204475153656]
[32,92,724.32,5.9512999999999998E-5,0.99173,4.0636999999999999,4.0975870448610001]
[32,93,728.01,6.0047999999999998E-5,0.98806000000000005,3.9685000000000001,4.0164564904965285]
[32,94,731.53,6.0563999999999998E-5,0.98468,3.8820999999999999,3.9424990859974813]
[32,95,734.91,6.1062999999999995E-5,0.98155000000000003,3.8031000000000001,3.8745861137996025]
[32,96,738.15,6.1546999999999999E-5,0.97865000000000002,3.7305999999999999,3.8119858989424205]
[32,97,741.27,6.2014999999999995E-5,0.97596000000000005,3.6637,3.7539448338046637]
[32,98,744.28,6.2471000000000005E-5,0.97343999999999997,3.6017999999999999,3.7000739644970415]
[32,99,747.18,6.2915000000000003E-5,0.97109000000000001,3.5442,3.649713208868385]
[32,100,749.98,6.3347000000000002E-5,0.96887999999999996,3.4904999999999999,3.6026133267277682]
[32,101,752.7,6.3768000000000003E-5,0.96680999999999995,3.4403000000000001,3.5584034091496783]
[32,102,755.33,6.4179999999999999E-5,0.96486000000000005,3.3932000000000002,3.5167796364239372]
[32,103,757.88,6.4581999999999999E-5,0.96301999999999999,3.3489,3.4774978712799318]
[32,104,760.36,6.4975999999999996E-5,0.96128999999999998,3.3071999999999999,3.4403769934150983]
[32,105,762.78,6.5362000000000002E-5,0.95965,3.2677,3.4050956077736676]
[32,106,765.12,6.5740000000000004E-5,0.95809,3.2303999999999999,3.3717082946278532]
[32,107,767.41,6.6111000000000005E-5,0.95660999999999996,3.1949999999999998,3.339919089284034]
[32,108,769.65,6.6475000000000003E-5,0.95521,3.1613000000000002,3.3095340291663615]
[32,109,771.82,6.6832E-5,0.95387,3.1293000000000002,3.2806357260423331]
[32,110,773.95,6.7183999999999999E-5,0.9526,3.0987,3.2528868360277134]
[32,111,776.03,6.7528999999999997E-5,0.95138,3.0695000000000001,3.2263659105720115]
[32,112,778.07,6.7868999999999997E-5,0.95021999999999995,3.0417000000000001,3.2010481783166007]
[32,113,780.06,6.8202999999999997E-5,0.94911000000000001,3.0150000000000001,3.176660239592882]
[32,114,782,6.8532E-5,0.94803999999999999,2.9893999999999998,3.1532424792202858]
[32,115,783.91,6.8856999999999995E-5,0.94703000000000004,2.9649000000000001,3.1307350347929845]
[32,116,785.78,6.9176000000000003E-5,0.94604999999999995,2.9413,3.1090322921621483]
[32,117,787.62,6.9492000000000005E-5,0.94511000000000001,2.9186000000000001,3.0881061463744963]
[32,118,789.42,6.9802999999999996E-5,0.94420999999999999,2.8967999999999998,3.0679615763442452]
[32,119,791.19,7.0109000000000002E-5,0.94333999999999996,2.8757999999999999,3.0485296923696654]
[32,120,792.92,7.0412000000000003E-5,0.94250999999999996,2.8555000000000001,3.0296760777073986]
[32,121,794.62,7.0710999999999994E-5,0.94171000000000005,2.8359999999999999,3.0115428316573039]
[32,122,796.3,7.1006000000000004E-5,0.94093000000000004,2.8170999999999999,2.9939527913872443]
[32,123,797.95,7.1297999999999994E-5,0.94018999999999997,2.7989000000000002,2.9769514672566184]
[32,124,799.56,7.1586000000000002E-5,0.93947000000000003,2.7812000000000001,2.9603925617635474]
[32,125,801.16,7.1871000000000004E-5,0.93876999999999999,2.7641,2.9443846735622143]
[32,126,802.73,7.2152999999999998E-5,0.93810000000000004,2.7475999999999998,2.9288988380769636]
[32,127,804.27,7.2432E-5,0.93745000000000001,2.7315999999999998,2.913862072643874]
[32,128,805.79,7.2707999999999996E-5,0.93681999999999999,2.7160000000000002,2.8991695309664611]
[32,129,807.29,7.2979999999999996E-5,0.93622000000000005,2.7008999999999999,2.8848988485612352]
[32,130,808.76,7.3250000000000005E-5,0.93562999999999996,2.6863000000000001,2.871113581223347]
[32,131,810.21,7.3517999999999996E-5,0.93506,2.6720999999999999,2.8576775821872391]
[32,132,811.65,7.3782000000000006E-5,0.93450999999999995,2.6583000000000001,2.8445923532118438]
[32,133,813.06,7.4043999999999998E-5,0.93398000000000003,2.6448,2.8317522859161866]
[32,134,814.45,7.4303999999999999E-5,0.93345999999999996,2.6316999999999999,2.8192959526921348]
[32,135,815.83,7.4561000000000007E-5,0.93296000000000001,2.6190000000000002,2.8071943062939462]
[32,136,817.18,7.4815999999999997E-5,0.93247000000000002,2.6065999999999998,2.7953714328611103]
[32,137,818.52,7.5068999999999996E-5,0.93200000000000005,2.5945999999999998,2.7839055793991414]
[32,138,819.85,7.5319000000000002E-5,0.93154000000000003,2.5828000000000002,2.7726130922987742]
[32,139,821.15,7.5567000000000003E-5,0.93108999999999997,2.5712999999999999,2.7616019933626181]
[32,140,822.44,7.5813000000000001E-5,0.93066000000000004,2.5602,{"$f":"F195/E195","v":2.7509509380439687}]
[32,141,823.71,7.6056999999999994E-5,0.93023999999999996,2.5493000000000001,2.7404755761953905]
[32,142,824.97,7.6298999999999996E-5,0.92983000000000005,2.5386000000000002,2.7301764838733962]
[32,143,826.21,7.6538999999999993E-5,0.92942999999999998,2.5282,2.7201618196098685]
[32,144,827.44,7.6778000000000002E-5,0.92903999999999998,2.5181,2.7104322741754929]
[32,145,828.66,7.7014000000000005E-5,0.92867,2.5081000000000002,2.7007440748597458]
[32,146,829.86,7.7249000000000005E-5,0.92830000000000001,2.4984000000000002,2.6913713239254551]
[32,147,831.05,7.7480999999999999E-5,0.92795000000000005,2.4889999999999999,2.6822565871005977]
[32,148,832.22,7.7713000000000006E-5,0.92759999999999998,2.4796999999999998,2.6732427770590772]
[32,149,833.38,7.7941999999999993E-5,0.92725999999999997,2.4706000000000001,2.6644091193408541]
[32,150,834.53,7.8170000000000005E-5,0.92693000000000003,2.4617,2.6557560980872341]
[32,151,835.67,7.8396E-5,0.92661000000000004,2.4531000000000001,2.6473921067115613]
[32,152,836.79,7.8621000000000005E-5,0.92630000000000001,2.4445000000000001,2.6389938464860196]
[32,153,837.91,7.8844000000000006E-5,0.92600000000000005,2.4361999999999999,2.6308855291576672]
[32,154,839.01,7.9065000000000003E-5,0.92569999999999997,2.4281000000000001,2.6229880090742141]
[32,155,840.1,7.9285999999999999E-5,0.92540999999999995,2.4201000000000001,2.6151651700327427]
[32,156,841.18,7.9504000000000003E-5,0.92513000000000001,2.4121999999999999,2.6074173359419754]
[32,157,842.25,7.9721999999999993E-5,0.92486000000000002,2.4045000000000001,2.5998529507168655]
[32,158,843.31,7.9938000000000006E-5,0.92459000000000002,2.3969999999999998,2.592500459663202]
[32,159,844.36,8.0152000000000001E-5,0.92432999999999998,2.3896000000000002,2.5852238919000792]
[32,160,845.4,8.0365999999999996E-5,0.92406999999999995,2.3824000000000001,2.5781596632289765]
[32,161,846.43,8.0578E-5,0.92383000000000004,2.3752,2.5710357966292499]
[32,162,847.45,8.0789000000000002E-5,0.92357999999999996,2.3683000000000001,2.5642608111912342]
[32,163,848.46,8.0997999999999999E-5,0.92335,2.3614000000000002,2.557426761249797]
[32,164,849.46,8.1205999999999995E-5,0.92312000000000005,2.3546999999999998,2.5508059623884214]
[32,165,850.45,8.1414000000000004E-5,0.92288999999999999,2.3479999999999999,2.5441818634940243]
[32,166,851.44,8.1619999999999994E-5,0.92266999999999999,2.3416000000000001,2.5378521031354655]
[32,167,852.42,8.1823999999999995E-5,0.92245999999999995,2.3351999999999999,2.5314918804067386]
[32,168,853.38,8.2027999999999995E-5,0.92225000000000001,2.3289,2.525237191650854]
[32,169,854.34,8.2231000000000006E-5,0.92205000000000004,2.3227000000000002,2.5190607884604956]
[32,170,855.29,8.2432E-5,0.92184999999999995,2.3167,2.5130986603026524]
[32,171,856.24,8.2633000000000007E-5,0.92164999999999997,2.3107000000000002,2.5071339445559597]
[32,172,857.17,8.2831999999999996E-5,0.92145999999999995,2.3048999999999999,2.5013565428776072]
[32,173,858.1,8.3030999999999998E-5,0.92127999999999999,2.2991000000000001,2.4955496700243143]
[32,174,859.02,8.3227999999999997E-5,0.92110000000000003,2.2934000000000001,2.4898490934751929]
[32,175,859.93,8.3424999999999995E-5,0.92091999999999996,2.2877999999999998,2.4842548755592233]
[32,176,860.84,8.3620000000000002E-5,0.92074999999999996,2.2824,2.4788487645940811]
[32,177,861.74,8.3814999999999996E-5,0.92057999999999995,2.2770000000000001,2.4734406569771235]
[32,178,862.63,8.4007999999999999E-5,0.92042000000000002,2.2715999999999998,2.468003737424219]
[32,179,863.52,8.4201000000000002E-5,0.92025999999999997,2.2664,2.4627822571881861]
[32,180,864.4,8.4393000000000003E-5,0.92010000000000003,2.2612000000000001,2.4575589609825021]
[32,181,865.27,8.4583E-5,0.91995000000000005,2.2562000000000002,2.4525245937279201]
[32,182,866.13,8.4772999999999996E-5,0.91979999999999995,2.2511999999999999,2.4474885844748857]
[32,183,866.99,8.4962000000000004E-5,0.91964999999999997,2.2462,2.4424509324199426]
[32,184,867.84,8.5150999999999998E-5,0.91951000000000005,2.2414000000000001,2.4376026361866647]
[32,185,868.69,8.5338000000000002E-5,0.91937000000000002,2.2366000000000001,2.4327528633738322]
[32,186,869.53,8.5525000000000005E-5,0.91922999999999999,2.2319,2.4280104000087031]
[32,187,870.37,8.5711000000000007E-5,0.91910000000000003,2.2271999999999998,2.4232401262104228]
[32,188,871.2,8.5896000000000006E-5,0.91896999999999995,2.2227000000000001,2.418686137741167]
[32,189,872.02,8.6080000000000003E-5,0.91883999999999999,2.2181000000000002,2.4140220277741502]
[32,190,872.84,8.6262999999999997E-5,0.91871999999999998,2.2136999999999998,2.409548066875653]
[32,191,873.65,8.6446000000000005E-5,0.91859999999999997,2.2092999999999998,2.4050729370781623]
[32,192,874.45,8.6627999999999998E-5,0.91847999999999996,2.2050000000000001,2.4007055134570163]
[32,193,875.26,8.6809000000000002E-5,0.91837000000000002,2.2006999999999999,2.3963108551019738]
[32,194,876.05,8.6990000000000006E-5,0.91825000000000001,2.1964999999999999,2.3920500952899535]
[32,195,876.84,8.7169000000000005E-5,0.91813999999999996,2.1922999999999999,2.3877622149127586]
[32,196,877.63,8.7348999999999993E-5,0.91803999999999997,2.1882000000000001,2.3835562720578625]
[32,197,878.41,8.7527000000000004E-5,0.91793000000000002,2.1842000000000001,2.3794842744000086]
[32,198,879.18,8.7705000000000001E-5,0.91783000000000003,2.1802000000000001,2.3753854199579445]
[32,199,879.95,8.7881999999999996E-5,0.91773000000000005,2.1762000000000001,2.3712856722565459]
[32,200,880.72,8.8058000000000003E-5,0.91762999999999995,2.1722999999999999,2.3672940073885989]
[33,74,288.25,2.1977999999999999E-5,1.149,8.4710000000000001,7.3724978241949524]
[33,75,311.47000000000003,2.3025999999999999E-5,1.2057,11.804,9.7901633905614993]
[33,76,346.97,2.4796000000000001E-5,1.296,20.372,15.719135802469134]
[33,77,430.52,2.9816999999999999E-5,1.474,65.524000000000001,{"$f":"F259/E259","v":44.453188602442339}]
[33,78,551.21,3.9437999999999997E-5,1.2763,27.335000000000001,21.417378359319908]
[33,79,590.9,4.3306000000000002E-5,1.1814,14.852,12.571525308955477]
[33,80,613.67999999999995,4.5704999999999997E-5,1.1391,10.936,9.6005618470722496]
[33,81,629.95000000000005,4.7503999999999998E-5,1.1117999999999999,8.9710999999999999,8.0689872279186918]
[33,82,642.73,4.8968999999999998E-5,1.0914999999999999,7.7744999999999997,7.1227668346312418]
[33,83,653.30999999999995,5.0219000000000001E-5,1.0752999999999999,6.9618000000000002,6.4742862456988757]
[33,84,662.38,5.1316999999999997E-5,1.0619000000000001,6.3695000000000004,5.9982107543083156]
[33,85,670.35,5.2302999999999997E-5,1.0504,5.9162999999999997,5.6324257425742568]
[33,86,677.47,5.3201000000000001E-5,1.0406,5.5567000000000002,5.339900057659043]
[33,87,683.91,5.4029000000000001E-5,1.0319,5.2633000000000001,5.100591142552573]
[33,88,689.82,5.4799000000000002E-5,1.0243,5.0187999999999997,4.8997364053499952]
[33,89,695.27,5.5520999999999999E-5,1.0176000000000001,4.8113999999999999,4.7281839622641506]
[33,90,700.34,5.6202000000000002E-5,1.0115000000000001,4.6327999999999996,4.5801285219970334]
[33,91,705.09,5.6848000000000002E-5,1.0061,4.4771000000000001,4.4499552728357026]
[33,92,709.56,5.7463000000000002E-5,1.0012000000000001,4.34,4.3347982421094677]
[33,93,713.78,5.8050000000000002E-5,0.99668000000000001,4.2180999999999997,4.2321507404583212]
[33,94,717.78,5.8613999999999998E-5,0.99258000000000002,4.1089000000000002,4.139615950351609]
[33,95,721.59,5.9156000000000001E-5,0.98882999999999999,4.0103999999999997,4.0557021935014106]
[33,96,725.22,5.9678E-5,0.98536999999999997,3.9209999999999998,3.9792159290418825]
[33,97,728.7,6.0183000000000003E-5,0.98218000000000005,3.8393000000000002,3.9089576248752773]
[33,98,732.04,6.0671999999999998E-5,0.97923000000000004,3.7645,3.844347089039347]
[33,99,735.25,6.1146E-5,0.97648000000000001,3.6953999999999998,3.7844093068982465]
[33,100,738.34,6.1606999999999995E-5,0.97392000000000001,3.6316000000000002,3.7288483653688189]
[33,101,741.32,6.2055000000000001E-5,0.97153,3.5722999999999998,3.6769837266991239]
[33,102,744.2,6.2490999999999995E-5,0.96928999999999998,3.5169999999999999,3.628429056319574]
[33,103,746.98,6.2916999999999994E-5,0.96718999999999999,3.4653999999999998,3.5829568130357012]
[33,104,749.68,6.3331999999999996E-5,0.96521999999999997,3.4169999999999998,3.5401255672281966]
[33,105,752.3,6.3738000000000005E-5,0.96335999999999999,3.3715000000000002,3.4997301112771968]
[33,106,754.85,6.4134999999999995E-5,0.96160000000000001,3.3285999999999998,3.4615224625623959]
[33,107,757.32,6.4523999999999994E-5,0.95994000000000002,3.2881999999999998,3.4254224222347229]
[33,108,759.73,6.4905000000000003E-5,0.95837000000000006,3.2498999999999998,3.391070254703298]
[33,109,762.07,6.5278999999999996E-5,0.95687999999999995,3.2136,3.3584148482568348]
[33,110,764.36,6.5646000000000001E-5,0.95545999999999998,3.1791,3.3272978460636762]
[33,111,766.59,6.6006000000000005E-5,0.95411000000000001,3.1463000000000001,3.2976281560826322]
[33,112,768.76,6.6359999999999995E-5,0.95282,3.1151,3.2693478306500703]
[33,113,770.89,6.6706999999999997E-5,0.9516,3.0853000000000002,3.2422236233711645]
[33,114,772.97,6.7049000000000001E-5,0.95043,3.0568,3.2162284439674673]
[33,115,775,6.7385999999999995E-5,0.94930999999999999,3.0295000000000001,3.1912652347494497]
[33,116,776.99,6.7717000000000002E-5,0.94823000000000002,3.0034000000000001,3.1673750039547368]
[33,117,778.94,6.8044000000000001E-5,0.94721,2.9782999999999999,3.1442869057547957]
[33,118,780.85,6.8365E-5,0.94621999999999995,2.9542999999999999,3.1222125932658367]
[33,119,782.73,6.8682000000000004E-5,0.94528000000000001,2.9312,3.1008801624915368]
[33,120,784.57,6.8994999999999999E-5,0.94437000000000004,2.9089,3.0802545612418859]
[33,121,786.37,6.9302999999999997E-5,0.94350000000000001,2.8875000000000002,3.0604133545310019]
[33,122,788.14,6.9608000000000002E-5,0.94266000000000005,2.8668999999999998,3.0412874207031164]
[33,123,789.88,6.9907999999999995E-5,0.94184999999999997,2.847,3.0227743271221534]
[33,124,791.59,7.0204999999999996E-5,0.94106999999999996,2.8277000000000001,3.0047711647380111]
[33,125,793.27,7.0498000000000002E-5,0.94032000000000004,2.8092000000000001,2.987493619193466]
[33,126,794.92,7.0788000000000001E-5,0.93959000000000004,2.7911999999999999,2.9706574144041547]
[33,127,796.54,7.1074000000000004E-5,0.93889,2.7738,2.9543396990062734]
[33,128,798.14,7.1357000000000001E-5,0.93820999999999999,2.7570000000000001,2.9385745195638506]
[33,129,799.71,7.1637000000000005E-5,0.93755999999999995,2.7406999999999999,2.9232262468535346]
[33,130,801.26,7.1914000000000003E-5,0.93693000000000004,2.7248999999999999,2.9083282635842589]
[33,131,802.78,7.2187999999999994E-5,0.93632000000000004,2.7096,2.8938824333561173]
[33,132,804.29,7.2459000000000005E-5,0.93572,2.6947000000000001,2.8798144744154235]
[33,133,805.77,7.2726999999999997E-5,0.93515000000000004,2.6802000000000001,2.8660642677645298]
[33,134,807.23,7.2992999999999997E-5,0.93459000000000003,2.6661999999999999,2.8528017633400742]
[33,135,808.66,7.3256000000000005E-5,0.93406,2.6524999999999999,2.8397533349035391]
[33,136,810.08,7.3516999999999994E-5,0.93352999999999997,2.6392000000000002,2.8271185714438745]
[33,137,811.48,7.3775000000000004E-5,0.93303000000000003,2.6263000000000001,2.8148076696354889]
[33,138,812.86,7.4029999999999994E-5,0.93252999999999997,2.6137000000000001,2.8028052716802678]
[33,139,814.23,7.4283999999999996E-5,0.93206,2.6015000000000001,2.7911293264382122]
[33,140,815.57,7.4535000000000004E-5,0.93159000000000003,2.5895999999999999,2.7797636299230346]
[33,141,816.9,7.4783999999999994E-5,0.93113999999999997,2.5779000000000001,{"$f":"F323/E323","v":2.7685417874863072}]
[33,142,818.21,7.5030999999999994E-5,0.93069999999999997,2.5666000000000002,2.7577092511013217]
[33,143,819.5,7.5275E-5,0.93028,2.5554999999999999,2.7470224018575053]
[33,144,820.78,7.5518000000000004E-5,0.92986999999999997,2.5447000000000002,2.7366190972931701]
[33,145,822.05,7.5759000000000004E-5,0.92945999999999995,2.5341999999999998,2.7265293826522927]
[33,146,823.3,7.5998E-5,0.92906999999999995,2.5238999999999998,2.7165875552972327]
[33,147,824.53,7.6235000000000004E-5,0.92869000000000002,2.5137999999999998,2.7068235902184794]
[33,148,825.75,7.6470000000000005E-5,0.92832000000000003,2.504,2.6973457428472938]
[33,149,826.96,7.6703000000000001E-5,0.92796000000000001,2.4943,2.6879391353075563]
[33,150,828.15,7.6934999999999994E-5,0.92761000000000005,2.4849000000000001,2.6788197626157544]
[33,151,829.33,7.7164999999999997E-5,0.92727000000000004,2.4758,2.6699882450634655]
[33,152,830.5,7.7392999999999996E-5,0.92693000000000003,2.4668000000000001,2.6612581316820041]
[33,153,831.65,7.7620000000000006E-5,0.92661000000000004,2.4580000000000002,2.6526801998683371]
[33,154,832.79,7.7844999999999998E-5,0.92628999999999995,2.4493,2.6442042988696848]
[33,155,833.93,7.8067999999999999E-5,0.92598999999999998,2.4409000000000001,2.6359895895204053]
[33,156,835.04,7.8289999999999998E-5,0.92569000000000001,2.4325999999999999,2.6278775832082011]
[33,157,836.15,7.8510999999999994E-5,0.92539000000000005,2.4245000000000001,2.6199764423648406]
[33,158,837.25,7.873E-5,0.92510999999999999,2.4165999999999999,2.6122298969852231]
[33,159,838.34,7.8948000000000004E-5,0.92483000000000004,2.4087999999999998,2.6045867889233696]
[33,160,839.41,7.9164000000000003E-5,0.92456000000000005,2.4011999999999998,2.5971272821666518]
[33,161,840.48,7.9379E-5,0.92428999999999994,2.3936999999999999,2.5897716084778586]
[33,162,841.53,7.9592999999999995E-5,0.92403999999999997,2.3862999999999999,2.5824639625990216]
[33,163,842.58,7.9804999999999999E-5,0.92378000000000005,2.3791000000000002,2.575396739483427]
[33,164,843.61,8.0016000000000001E-5,0.92354000000000003,2.3721000000000001,2.5684864759512314]
[33,165,844.64,8.0226000000000001E-5,0.92330000000000001,2.3651,2.5615726199501787]
[33,166,845.65,8.0433999999999996E-5,0.92305999999999999,2.3582999999999998,2.554871839317054]
[33,167,846.66,8.0642000000000005E-5,0.92283999999999999,2.3515999999999999,2.5482207099822287]
[33,168,847.66,8.0847999999999996E-5,0.92261000000000004,2.3450000000000002,2.5417023444358939]
[33,169,848.65,8.1052999999999998E-5,0.92239000000000004,2.3386,2.5353700712280056]
[33,170,849.63,8.1256999999999998E-5,0.92218,2.3321999999999998,2.5290073521438328]
[33,171,850.6,8.1459999999999996E-5,0.92196999999999996,2.3260000000000001,2.5228586613447295]
[33,172,851.57,8.1661000000000003E-5,0.92176999999999998,2.3199000000000001,2.5167883528429003]
[33,173,852.52,8.1861999999999997E-5,0.92157,2.3138000000000001,2.5107154095727942]
[33,174,853.47,8.2060999999999999E-5,0.92137999999999998,2.3079000000000001,2.5048297119538088]
[33,175,854.41,8.2260000000000002E-5,0.92118999999999995,2.3020999999999998,2.4990501416645858]
[33,176,855.35,8.2458000000000002E-5,0.92101,2.2963,2.4932411157316423]
[33,177,856.27,8.2653999999999998E-5,0.92083000000000004,2.2907000000000002,2.4876470141068383]
[33,178,857.19,8.2849999999999995E-5,0.92064999999999997,2.2850999999999999,2.482050725031228]
[33,179,858.1,8.3044E-5,0.92047999999999996,2.2797000000000001,2.4766426212410919]
[33,180,859,8.3238000000000005E-5,0.92030999999999996,2.2743000000000002,2.471232519477133]
[33,181,859.9,8.3430000000000006E-5,0.92015000000000002,2.2690000000000001,2.4659022985382819]
[33,182,860.79,8.3622000000000007E-5,0.91998999999999997,2.2637999999999998,2.4606789204230481]
[33,183,861.68,8.3813000000000005E-5,0.91983000000000004,2.2585999999999999,2.4554537251448636]
[33,184,862.55,8.4003000000000002E-5,0.91968000000000005,2.2536,2.4504175365344465]
[33,185,863.42,8.4191999999999996E-5,0.91952999999999996,2.2486000000000002,2.4453797048492167]
[33,186,864.29,8.4381000000000004E-5,0.91939000000000004,2.2437,2.4404224540184254]
[33,187,865.14,8.4567999999999994E-5,0.91923999999999995,2.2389000000000001,2.4355989730647059]
[33,188,865.99,8.4754999999999997E-5,0.91910000000000003,2.2341000000000002,2.4307474703514309]
[33,189,866.84,8.4939999999999997E-5,0.91896999999999995,2.2294,2.4259769089306507]
[33,190,867.68,8.5124999999999996E-5,0.91883999999999999,2.2248000000000001,2.4213138304819122]
[33,191,868.51,8.5309999999999995E-5,0.91871000000000003,2.2202000000000002,2.4166494323562389]
[33,192,869.34,8.5493000000000003E-5,0.91857999999999995,2.2157,2.4120925776742363]
[33,193,870.16,8.5675999999999998E-5,0.91844999999999999,2.2113,2.4076433121019107]
[33,194,870.98,8.5857000000000001E-5,0.91832999999999998,2.2069000000000001,2.4031666176646742]
[33,195,871.79,8.6038999999999994E-5,0.91822000000000004,2.2025999999999999,2.3987715362331463]
[33,196,872.59,8.6218999999999996E-5,0.91810000000000003,2.1983000000000001,2.3944014813201178]
[33,197,873.39,8.6398999999999997E-5,0.91798999999999997,2.1941000000000002,2.3901131820608068]
[33,198,874.19,8.6577999999999997E-5,0.91788000000000003,2.19,2.3859328016734214]
[33,199,874.98,8.6755999999999994E-5,0.91776999999999997,2.1859000000000002,2.3817514192008895]
[33,200,875.76,8.6933000000000003E-5,0.91766000000000003,2.1819000000000002,2.3776780071050281]
[34,74,271.82,2.1345E-5,1.095,6.3685,5.8159817351598173]
[34,75,288.3,2.2036E-5,1.1303000000000001,7.8003,6.9010882066707948]
[34,76,309.04000000000002,2.2968000000000001E-5,1.1756,10.196,8.6730180333446754]
[34,77,337.53,2.4360000000000001E-5,1.2376,14.928000000000001,12.062055591467356]
[34,78,383.66,2.6902000000000001E-5,1.3279000000000001,27.172999999999998,{"$f":"F387/E387","v":20.463137284434065}]
[34,79,473.47,3.2948999999999999E-5,1.3607,42.65,31.344161093554785]
[34,80,546.47,3.9048999999999998E-5,1.2390000000000001,22.484000000000002,18.146892655367232]
[34,81,581.75,4.2425999999999997E-5,1.1752,14.221,12.100918992511913]
[34,82,604.16999999999996,4.473E-5,1.139,10.87,9.5434591747146609]
[34,83,620.66999999999996,4.6511999999999998E-5,1.1133999999999999,9.0338999999999992,8.1137955811029272]
[34,84,633.78,4.7981E-5,1.0934999999999999,7.8686999999999996,7.1958847736625513]
[34,85,644.70000000000005,4.9240999999999998E-5,1.0772999999999999,7.0601000000000003,6.5535134131625368]
[34,86,654.08000000000004,5.0352000000000002E-5,1.0637000000000001,6.4635999999999996,6.0765253360910023]
[34,87,662.32,5.1350000000000001E-5,1.0521,6.0035999999999996,5.7063016823495856]
[34,88,669.69,5.2259999999999998E-5,1.042,5.6368999999999998,5.4096928982725521]
[34,89,676.36,5.3099000000000001E-5,1.0331999999999999,5.3368000000000002,5.1653116531165315]
[34,90,682.47,5.3879999999999999E-5,1.0254000000000001,5.0861000000000001,4.9601131265847469]
[34,91,688.1,5.4611999999999998E-5,1.0185,4.8730000000000002,4.7844869906725584]
[34,92,693.34,5.5302E-5,1.0124,4.6893000000000002,4.6318648755432639]
[34,93,698.24,5.5955999999999998E-5,1.0067999999999999,4.5292000000000003,4.4986094557012324]
[34,94,702.85,5.6577999999999999E-5,1.0018,4.3879999999999999,4.3801157915751645]
[34,95,707.2,5.7173000000000003E-5,0.99724999999999997,4.2625000000000002,4.2742541990473804]
[34,96,711.32,5.7742999999999999E-5,0.99309000000000003,4.1501000000000001,4.1789767291987632]
[34,97,715.24,5.8291000000000001E-5,0.98928000000000005,4.0487000000000002,4.0925723758693193]
[34,98,718.98,5.8819E-5,0.98577999999999999,3.9567000000000001,4.0137758932013226]
[34,99,722.56,5.9329000000000001E-5,0.98255000000000003,3.8727,3.941478805149865]
[34,100,725.98,5.9823E-5,0.97955999999999999,3.7957000000000001,3.8749030176814081]
[34,101,729.28,6.0300999999999997E-5,0.97677999999999998,3.7248000000000001,3.8133458916030225]
[34,102,732.45,6.0766000000000001E-5,0.97419999999999995,3.6591999999999998,3.7561075754465203]
[34,103,735.51,6.1217999999999996E-5,0.97177999999999998,3.5983000000000001,3.7027928131881702]
[34,104,738.46,6.1657999999999998E-5,0.96953,3.5415999999999999,3.6529039844048143]
[34,105,741.32,6.2088000000000006E-5,0.96740999999999999,3.4885999999999999,3.6061235670501648]
[34,106,744.09,6.2506000000000001E-5,0.96541999999999994,3.4390000000000001,3.5621801910049515]
[34,107,746.77,6.2916000000000005E-5,0.96355000000000002,3.3923999999999999,3.5207306315188625]
[34,108,749.37,6.3316000000000002E-5,0.96177999999999997,3.3485,3.4815654307637924]
[34,109,751.9,6.3707999999999994E-5,0.96011000000000002,3.3071000000000002,3.4445011509097916]
[34,110,754.37,6.4091999999999996E-5,0.95852999999999999,3.2679999999999998,3.4093872909559426]
[34,111,756.77,6.4467999999999993E-5,0.95701999999999998,3.2307999999999999,3.3758960105326952]
[34,112,759.1,6.4837000000000003E-5,0.9556,3.1956000000000002,3.3440770196735037]
[34,113,761.38,6.5198999999999997E-5,0.95423999999999998,3.1621000000000001,3.3137365861837695]
[34,114,763.61,6.5555000000000005E-5,0.95294999999999996,3.1301999999999999,3.2847473634503386]
[34,115,765.78,6.5905E-5,0.95172000000000001,3.0998000000000001,3.2570503929727233]
[34,116,767.9,6.6248999999999995E-5,0.95054000000000005,3.0707,3.2304795169061795]
[34,117,769.98,6.6587999999999993E-5,0.94942000000000004,3.0430000000000001,3.2051147016072972]
[34,118,772.01,6.6921000000000005E-5,0.94833999999999996,3.0163000000000002,3.1806103296286143]
[34,119,774.01,6.7249000000000006E-5,0.94730999999999999,2.9908000000000001,3.1571502464874226]
[34,120,775.96,6.7572999999999998E-5,0.94632000000000005,2.9662999999999999,3.1345633612308732]
[34,121,777.87,6.7891000000000004E-5,0.94537000000000004,2.9428000000000001,3.1128552841744503]
[34,122,779.74,6.8206000000000004E-5,0.94445999999999997,2.9201999999999999,3.0919255447557337]
[34,123,781.58,6.8516000000000006E-5,0.94357999999999997,2.8984000000000001,3.0717056317429368]
[34,124,783.39,6.8820999999999997E-5,0.94274000000000002,2.8774000000000002,3.0521670874260138]
[34,125,785.16,6.9122999999999995E-5,0.94191999999999998,2.8571,3.0332724647528453]
[34,126,786.9,6.9420999999999998E-5,0.94113999999999998,2.8376000000000001,3.0150668338398114]
[34,127,788.61,6.9715999999999995E-5,0.94037999999999999,2.8187000000000002,2.9974053042387121]
[34,128,790.29,7.0006999999999996E-5,0.93966000000000005,2.8003999999999998,2.9802268905774425]
[34,129,791.95,7.0294000000000002E-5,0.93894999999999995,2.7827999999999999,2.9637360881836092]
[34,130,793.58,7.0578000000000001E-5,0.93827000000000005,2.7656999999999998,2.9476589894166922]
[34,131,795.18,7.0858999999999994E-5,0.93761000000000005,2.7490999999999999,2.9320293085611286]
[34,132,796.75,7.1136999999999993E-5,0.93698000000000004,2.7330999999999999,2.9169245875045355]
[34,133,798.31,7.1412E-5,0.93635999999999997,2.7174999999999998,2.9021957366824722]
[34,134,799.84,7.1684E-5,0.93576000000000004,2.7023999999999999,2.8879199794819184]
[34,135,801.34,7.1953999999999996E-5,0.93518999999999997,2.6877,2.8739614409906009]
[34,136,802.83,7.2219999999999996E-5,0.93462999999999996,2.6735000000000002,2.8604902474776117]
[34,137,804.29,7.2484000000000006E-5,0.93408000000000002,2.6596000000000002,2.8472935936964716]
[34,138,805.74,7.2744999999999996E-5,0.93355999999999995,2.6461999999999999,2.83452590085265]
[34,139,807.16,7.3003999999999994E-5,0.93305000000000005,2.6331000000000002,2.8220352607041423]
[34,140,808.56,7.3261000000000002E-5,0.93254999999999999,2.6202999999999999,2.8098225296230765]
[34,141,809.95,7.3515000000000003E-5,0.93206999999999995,2.6078999999999999,2.7979658180179601]
[34,142,811.32,7.3767E-5,0.93159999999999998,2.5958000000000001,{"$f":"F451/E451","v":2.7863890081580078}]
[34,143,812.67,7.4016000000000004E-5,0.93115000000000003,2.5840000000000001,2.7750630940235195]
[34,144,814,7.4264000000000006E-5,0.93071000000000004,2.5724999999999998,2.7640188673163495]
[34,145,815.31,7.4509000000000001E-5,0.93028,2.5613000000000001,2.7532570838887218]
[34,146,816.61,7.4752999999999994E-5,0.92986000000000002,2.5503,2.7426709397113544]
[34,147,817.9,7.4993999999999994E-5,0.92945999999999995,2.5396000000000001,2.732339207712005]
[34,148,819.17,7.5233000000000003E-5,0.92906,2.5291999999999999,2.7223214862333971]
[34,149,820.42,7.5470999999999996E-5,0.92867999999999995,2.5190000000000001,2.7124520825257359]
[34,150,821.66,7.5705999999999996E-5,0.92830000000000001,2.5091000000000001,2.7028977701174188]
[34,151,822.89,7.5939999999999995E-5,0.92793999999999999,2.4992999999999999,2.6933853481906156]
[34,152,824.1,7.6172000000000002E-5,0.92757999999999996,2.4897999999999998,2.684188964833222]
[34,153,825.3,7.6402999999999993E-5,0.92723999999999995,2.4805000000000001,2.6751434364350115]
[34,154,826.48,7.6631999999999994E-5,0.92689999999999995,2.4714,2.6663070449886721]
[34,155,827.65,7.6859000000000004E-5,0.92657,2.4624999999999999,2.6576513377294755]
[34,156,828.81,7.7083999999999996E-5,0.92625000000000002,2.4537,2.649068825910931]
[34,157,829.96,7.7307999999999999E-5,0.92593999999999999,2.4451999999999998,2.6407758602069249]
[34,158,831.1,7.7529999999999998E-5,0.92564000000000002,2.4367999999999999,2.6325569335810894]
[34,159,832.22,7.7750999999999995E-5,0.92534000000000005,2.4285999999999999,2.6245488144898088]
[34,160,833.34,7.7971000000000003E-5,0.92505000000000004,2.4205999999999999,2.616723420355656]
[34,161,834.44,7.8189000000000006E-5,0.92476999999999998,2.4127000000000001,2.608973041945565]
[34,162,835.53,7.8405000000000006E-5,0.92449999999999999,2.4049999999999998,2.6014061654948617]
[34,163,836.61,7.8620000000000003E-5,0.92423,2.3974000000000002,2.5939430661199054]
[34,164,837.68,7.8833999999999998E-5,0.92396999999999996,2.39,2.5866640691797356]
[34,165,838.74,7.9047000000000004E-5,0.92371000000000003,2.3826999999999998,2.5794892336339323]
[34,166,839.79,7.9258000000000006E-5,0.92345999999999995,2.3755999999999999,2.572499079548654]
[34,167,840.83,7.9468000000000006E-5,0.92322000000000004,2.3685,2.5654773510105935]
[34,168,841.86,7.9677000000000003E-5,0.92298000000000002,2.3616000000000001,2.5586686602093223]
[34,169,842.88,7.9883999999999996E-5,0.92274999999999996,2.3549000000000002,2.5520455161202928]
[34,170,843.89,8.0091000000000003E-5,0.92252000000000001,2.3481999999999998,2.5454190695052681]
[34,171,844.9,8.0296000000000005E-5,0.92230000000000001,2.3416999999999999,2.5389786403556327]
[34,172,845.89,8.0500000000000005E-5,0.92208999999999997,2.3353000000000002,2.5326161220705141]
[34,173,846.88,8.0703000000000003E-5,0.92186999999999997,2.3290000000000002,2.5263865837916413]
[34,174,847.86,8.0904999999999999E-5,0.92166999999999999,2.3228,2.5202078835157922]
[34,175,848.83,8.1106000000000006E-5,0.92147000000000001,2.3167,2.5141350233865452]
[34,176,849.79,8.1304999999999995E-5,0.92127000000000003,2.3107000000000002,2.5081680723349291]
[34,177,850.74,8.1503999999999998E-5,0.92108000000000001,2.3048000000000002,2.5022799322534417]
[34,178,851.69,8.1700999999999996E-5,0.92088999999999999,2.2989999999999999,2.4964979530671414]
[34,179,852.62,8.1897999999999994E-5,0.92071000000000003,2.2932999999999999,2.4907951472233383]
[34,180,853.55,8.2094000000000004E-5,0.92052999999999996,2.2877000000000001,2.4851987442017101]
[34,181,854.48,8.2287999999999995E-5,0.92035999999999996,2.2822,2.479681863618584]
[34,182,855.39,8.2482000000000001E-5,0.92018999999999995,2.2766999999999999,2.4741629446092657]
[34,183,856.3,8.2675000000000004E-5,0.92001999999999995,2.2713999999999999,2.4688593726223345]
[34,184,857.2,8.2866000000000002E-5,0.91986000000000001,2.2660999999999998,2.4635270584654183]
[34,185,858.1,8.3057000000000001E-5,0.91969999999999996,2.2608999999999999,2.4583016200935086]
[34,186,858.98,8.3246999999999998E-5,0.91954000000000002,2.2557999999999998,2.4531831132957782]
[34,187,859.87,8.3436000000000005E-5,0.91939000000000004,2.2507999999999999,2.4481449656837686]
[34,188,860.74,8.3625E-5,0.91923999999999995,2.2458,2.4431051738392586]
[34,189,861.61,8.3812000000000003E-5,0.91908999999999996,2.2408999999999999,2.4381725402300103]
[34,190,862.47,8.3999000000000007E-5,0.91895000000000004,2.2361,2.4333206376843135]
[34,191,863.33,8.4184000000000006E-5,0.91881000000000002,2.2313999999999998,2.4285760929898452]
[34,192,864.18,8.4369000000000005E-5,0.91868000000000005,2.2267000000000001,2.4238037183785432]
[34,193,865.02,8.4553000000000002E-5,0.91854999999999998,2.2221000000000002,2.419138860160035]
[34,194,865.86,8.4736999999999999E-5,0.91842000000000001,2.2176,2.4145815639903314]
[34,195,866.69,8.4919000000000005E-5,0.91829000000000005,2.2130999999999998,2.4100229774907707]
[34,196,867.52,8.5100999999999997E-5,0.91817000000000004,2.2086999999999999,2.4055458139560209]
[34,197,868.34,8.5282000000000001E-5,0.91805000000000003,2.2042999999999999,2.40106747998475]
[34,198,869.15,8.5462000000000003E-5,0.91793000000000002,2.2000000000000002,2.3966969158868325]
[34,199,869.96,8.5642000000000004E-5,0.91781000000000001,2.1958000000000002,2.3924341639337121]
[34,200,870.77,8.5821000000000004E-5,0.91769999999999996,2.1916000000000002,2.3881442737277983]
[35,74,259.77,2.0920999999999998E-5,1.0573999999999999,5.2454000000000001,4.9606582182712318]
[35,75,272.97000000000003,2.1447E-5,1.083,6.0702999999999996,5.6050784856879039]
[35,76,288.44,2.2098000000000001E-5,1.1134999999999999,7.2484000000000002,6.5095644364616083]
[35,77,307.27,2.2940999999999999E-5,1.1507000000000001,9.0558999999999994,7.8699052750499687]
[35,78,331.5,2.4108999999999999E-5,1.1978,12.111000000000001,10.111036900985139]
[35,79,365.43,2.5908E-5,1.2579,17.946999999999999,{"$f":"F515/E515","v":14.267429843389776}]
[35,80,419.09,2.9161000000000001E-5,1.3170999999999999,29.594000000000001,22.469060815427834]
[35,81,490.77,3.4341999999999997E-5,1.2864,29.245000000000001,22.733986318407961]
[35,82,542.79999999999995,3.8761999999999999E-5,1.2162999999999999,19.03,15.645811066348765]
[35,83,574.13,4.1717000000000001E-5,1.169,13.401999999999999,11.464499572284002]
[35,84,595.70000000000005,4.3890000000000002E-5,1.137,10.631,9.3500439753737901]
[35,85,612.12,4.5623E-5,1.113,8.9838000000000005,8.0716981132075478]
[35,86,625.37,4.7076000000000001E-5,1.0936999999999999,7.8891,7.213221175825181]
[35,87,636.5,4.8331999999999997E-5,1.0777000000000001,7.1078999999999999,6.595434722093346]
[35,88,646.1,4.9446000000000001E-5,1.0642,6.5214999999999996,6.128077429054688]
[35,89,654.55999999999995,5.045E-5,1.0525,6.0640000000000001,5.7615201900237532]
[35,90,662.13,5.1366000000000003E-5,1.0424,5.6965000000000003,5.4647927858787417]
[35,91,668.99,5.2213000000000003E-5,1.0336000000000001,5.3940000000000001,5.2186532507739933]
[35,92,675.27,5.3001000000000003E-5,1.0258,5.1402000000000001,5.0109183076623118]
[35,93,681.07,5.3739000000000002E-5,1.0187999999999999,4.9238999999999997,4.8330388692579502]
[35,94,686.46,5.4435999999999999E-5,1.0125999999999999,4.7370000000000001,4.6780564882480746]
[35,95,691.5,5.5096000000000002E-5,1.0069999999999999,4.5736999999999997,4.5419066534260182]
[35,96,696.24,5.5724999999999999E-5,1.002,4.4297000000000004,4.4208582834331338]
[35,97,700.71,5.6325E-5,0.99741000000000002,4.3014999999999999,4.312669814820385]
[35,98,704.94,5.6901000000000003E-5,0.99322999999999995,4.1864999999999997,4.2150357923139659]
[35,99,708.97,5.7454000000000003E-5,0.98939999999999995,4.0827999999999998,4.126541338184758]
[35,100,712.81,5.7986999999999999E-5,0.98587999999999998,3.9885999999999999,4.0457256461232607]
[35,101,716.48,5.8501000000000001E-5,0.98263999999999996,3.9026999999999998,3.971647805910608]
[35,102,720,5.8999000000000002E-5,0.97963999999999996,3.8239000000000001,3.9033726675105145]
[35,103,723.38,5.9481999999999997E-5,0.97685,3.7513000000000001,3.8402006449301327]
[35,104,726.63,5.995E-5,0.97426000000000001,3.6842000000000001,3.7815367561020672]
[35,105,729.76,6.0405999999999997E-5,0.97184000000000004,3.6219999999999999,3.7269509384260782]
[35,106,732.78,6.0849E-5,0.96958,3.5640000000000001,3.6758183955939687]
[35,107,735.71,6.1280999999999998E-5,0.96745999999999999,3.5099,3.6279536104851879]
[35,108,738.54,6.1703000000000002E-5,0.96547000000000005,3.4592000000000001,3.5829181642101773]
[35,109,741.28,6.2114999999999997E-5,0.96358999999999995,3.4116,3.5405099679324197]
[35,110,743.95,6.2518E-5,0.96182000000000001,3.3668,3.5004470690981679]
[35,111,746.54,6.2912999999999999E-5,0.96014999999999995,3.3245,3.4624798208613239]
[35,112,749.05,6.3299000000000005E-5,0.95855999999999997,3.2845,3.4264939075279588]
[35,113,751.5,6.3676999999999994E-5,0.95706000000000002,3.2467000000000001,3.3923682945687834]
[35,114,753.89,6.4048999999999996E-5,0.95562999999999998,3.2107999999999999,3.3598777769638875]
[35,115,756.22,6.4412999999999995E-5,0.95426999999999995,3.1766000000000001,3.328827271107758]
[35,116,758.49,6.4770999999999994E-5,0.95298000000000005,3.1440999999999999,3.2992297844655707]
[35,117,760.71,6.5123000000000007E-5,0.95174999999999998,3.1132,3.2710270554242187]
[35,118,762.88,6.5469000000000006E-5,0.95057000000000003,3.0836000000000001,3.2439483678214125]
[35,119,765,6.5809000000000006E-5,0.94943999999999995,3.0552999999999999,3.2180021907650826]
[35,120,767.07,6.6143999999999996E-5,0.94837000000000005,3.0282,3.1930575619220347]
[35,121,769.1,6.6474000000000001E-5,0.94733000000000001,3.0023,3.1692229740428361]
[35,122,771.09,6.6798999999999995E-5,0.94633999999999996,2.9773000000000001,3.1461208445167701]
[35,123,773.04,6.7119000000000006E-5,0.94538999999999995,2.9533999999999998,3.1240017347338136]
[35,124,774.95,6.7434999999999994E-5,0.94447999999999999,2.9304000000000001,3.1026596645773337]
[35,125,776.83,6.7745999999999998E-5,0.94359999999999999,2.9083000000000001,3.0821322594319627]
[35,126,778.66,6.8052999999999994E-5,0.94274999999999998,2.887,3.0623176876160172]
[35,127,780.47,6.8355999999999994E-5,0.94194,2.8664000000000001,3.0430813002951358]
[35,128,782.24,6.8656000000000001E-5,0.94115000000000004,2.8466,3.0245975668065661]
[35,129,783.99,6.8950999999999998E-5,0.94038999999999995,2.8273999999999999,3.0066249109412051]
[35,130,785.7,6.9243000000000001E-5,0.93966000000000005,2.8089,2.989272715663112]
[35,131,787.39,6.9531999999999998E-5,0.93894999999999995,2.7909999999999999,2.972469247563768]
[35,132,789.04,6.9816999999999999E-5,0.93827000000000005,2.7736000000000001,2.9560787406610038]
[35,133,790.67,7.0098999999999994E-5,0.93761000000000005,2.7568000000000001,2.9402416783097451]
[35,134,792.28,7.0377999999999996E-5,0.93696999999999997,2.7406000000000001,2.9249602441913831]
[35,135,793.86,7.0654000000000005E-5,0.93635000000000002,2.7248000000000001,2.9100229614994393]
[35,136,795.41,7.0926999999999994E-5,0.93576000000000004,2.7094999999999998,2.8955073950585617]
[35,137,796.94,7.1197000000000003E-5,0.93516999999999995,2.6945999999999999,2.8814012425548294]
[35,138,798.46,7.1464000000000006E-5,0.93461000000000005,2.6802000000000001,2.8677202255486245]
[35,139,799.94,7.1729000000000004E-5,0.93406999999999996,2.6661000000000001,2.8542828695922151]
[35,140,801.41,7.1990999999999996E-5,0.93354000000000004,2.6524999999999999,2.8413351329348497]
[35,141,802.86,7.2249999999999994E-5,0.93301999999999996,2.6392000000000002,2.8286639085978869]
[35,142,804.29,7.2508000000000004E-5,0.93252999999999997,2.6263000000000001,2.8163169013329332]
[35,143,805.69,7.2762000000000006E-5,0.93203999999999998,2.6137000000000001,{"$f":"F579/E579","v":2.8042787863181839}]
[35,144,807.08,7.3015000000000005E-5,0.93157000000000001,2.6015000000000001,2.7925974430262892]
[35,145,808.46,7.3264999999999997E-5,0.93110999999999999,2.5895000000000001,2.7810892375766558]
[35,146,809.81,7.3512999999999999E-5,0.93067,2.5779000000000001,2.7699399357452159]
[35,147,811.15,7.3758999999999996E-5,0.93023999999999996,2.5665,2.7589654282765741]
[35,148,812.47,7.4003000000000003E-5,0.92981999999999998,2.5554999999999999,2.7483814071540729]
[35,149,813.77,7.4245000000000005E-5,0.92940999999999996,2.5446,2.7378659579733382]
[35,150,815.06,7.4485000000000003E-5,0.92901,2.5341,2.7277424354958506]
[35,151,816.33,7.4722999999999996E-5,0.92862,2.5238,2.717796299885852]
[35,152,817.59,7.4958999999999998E-5,0.92823999999999995,2.5137,2.708028096182022]
[35,153,818.84,7.5192999999999996E-5,0.92788000000000004,2.5038999999999998,2.6985170496184847]
[35,154,820.07,7.5425000000000004E-5,0.92752000000000001,2.4942000000000002,2.6891064343626017]
[35,155,821.28,7.5655999999999995E-5,0.92717000000000005,2.4847999999999999,2.6799831746065985]
[35,156,822.49,7.5884999999999996E-5,0.92683000000000004,2.4756,2.6710399965473712]
[35,157,823.68,7.6112999999999994E-5,0.92649999999999999,2.4666000000000001,2.6622773880194281]
[35,158,824.85,7.6339000000000002E-5,0.92618,2.4578000000000002,2.6536958258653827]
[35,159,826.02,7.6563000000000005E-5,0.92586000000000002,2.4491000000000001,2.6452163394033654]
[35,160,827.17,7.6785000000000004E-5,0.92554999999999998,2.4407000000000001,2.6370266328129222]
[35,161,828.31,7.7007000000000003E-5,0.92525000000000002,2.4323999999999999,2.6289111051067278]
[35,162,829.44,7.7225999999999995E-5,0.92496,2.4243000000000001,2.620978204462896]
[35,163,830.56,7.7445000000000001E-5,0.92467999999999995,2.4163000000000001,2.6131202145607131]
[35,164,831.67,7.7661000000000001E-5,0.9244,2.4085000000000001,2.6054738208567723]
[35,165,832.76,7.7877E-5,0.92413000000000001,2.4007999999999998,2.5979028924501963]
[35,166,833.85,7.8090999999999995E-5,0.92386000000000001,2.3933,2.5905440218214881]
[35,167,834.92,7.8304000000000001E-5,0.92359999999999998,2.3860000000000001,2.5833694239930707]
[35,168,835.99,7.8515000000000003E-5,0.92335,2.3786999999999998,2.5761628851464771]
[35,169,837.04,7.8725000000000003E-5,0.92310999999999999,2.3715999999999999,2.5691412724377378]
[35,170,838.09,7.8934E-5,0.92286999999999997,2.3647,2.5623327229187209]
[35,171,839.12,7.9141999999999995E-5,0.92262999999999995,2.3578000000000001,2.5555206312389585]
[35,172,840.15,7.9348E-5,0.9224,2.3511000000000002,2.5488941890719863]
[35,173,841.16,7.9554000000000004E-5,0.92218,2.3445,2.5423453121950161]
[35,174,842.17,7.9758000000000004E-5,0.92196,2.3380999999999998,2.536010239055924]
[35,175,843.17,7.9961000000000002E-5,0.92174999999999996,2.3317000000000001,2.5296446975861135]
[35,176,844.16,8.0162999999999998E-5,0.92154000000000003,2.3254000000000001,2.5233847689736746]
[35,177,845.14,8.0364000000000005E-5,0.92132999999999998,2.3193000000000001,2.5173390641789588]
[35,178,846.12,8.0562999999999994E-5,0.92113,2.3132000000000001,2.5112633395937598]
[35,179,847.08,8.0761999999999997E-5,0.92093999999999998,2.3073000000000001,2.5053749429930292]
[35,180,848.04,8.0959999999999997E-5,0.92074999999999996,2.3014000000000001,2.499484116209612]
[35,181,848.99,8.1155999999999993E-5,0.92056000000000004,2.2957000000000001,2.4938081167984705]
[35,182,849.93,8.1352000000000003E-5,0.92037999999999998,2.29,2.4881027401725375]
[35,183,850.87,8.1545999999999995E-5,0.92020000000000002,2.2844000000000002,2.4825038035209737]
[35,184,851.8,8.174E-5,0.92003000000000001,2.2789000000000001,2.4769844461593644]
[35,185,852.72,8.1933000000000003E-5,0.91986000000000001,2.2734999999999999,2.4715717609201397]
[35,186,853.63,8.2125000000000004E-5,0.91969999999999996,2.2682000000000002,2.4662389909753184]
[35,187,854.53,8.2315E-5,0.91952999999999996,2.2629999999999999,2.4610398790686547]
[35,188,855.43,8.2504999999999997E-5,0.91937999999999998,2.2578,2.4557854206095415]
[35,189,856.33,8.2694999999999993E-5,0.91922000000000004,2.2526999999999999,2.4506646939796783]
[35,190,857.21,8.2882999999999999E-5,0.91907000000000005,2.2477,2.4456243811679195]
[35,191,858.09,8.3070000000000003E-5,0.91891999999999996,2.2427999999999999,2.4406912462455925]
[35,192,858.96,8.3257000000000006E-5,0.91878000000000004,2.238,2.4358388297524978]
[35,193,859.83,8.3442000000000005E-5,0.91864000000000001,2.2332000000000001,2.4309849342506316]
[35,194,860.69,8.3627000000000004E-5,0.91849999999999998,2.2284999999999999,2.4262384322264561]
[35,195,861.54,8.3811000000000001E-5,0.91837000000000002,2.2238000000000002,2.4214641157703323]
[35,196,862.39,8.3993999999999996E-5,0.91822999999999999,2.2191999999999998,2.4168236716291123]
[35,197,863.23,8.4177000000000004E-5,0.91810000000000003,2.2147000000000001,2.4122644592092364]
[35,198,864.07,8.4357999999999994E-5,0.91798000000000002,2.2101999999999999,2.4076777271835987]
[35,199,864.9,8.4538999999999998E-5,0.91786000000000001,2.2059000000000002,2.403307693983832]
[35,200,865.72,8.4720000000000002E-5,0.91774,2.2014999999999998,2.3988275546451061]
[36,74,250.2,2.0611E-5,1.0288999999999999,4.5346000000000002,4.4072310234230736]
[36,75,261.39999999999998,2.1039999999999998E-5,1.0488999999999999,5.0822000000000003,4.845266469634856]
[36,76,274.05,2.1546999999999999E-5,1.0717000000000001,5.8014999999999999,5.4133619483064281]
[36,77,288.64,2.2163000000000001E-5,1.0981000000000001,6.7846000000000002,6.178490119296967]
[36,78,305.94,2.2935E-5,1.1293,8.1960999999999995,7.2576817497564861]
[36,79,327.23,2.3951000000000002E-5,1.1668000000000001,10.345000000000001,8.8661295851902633]
[36,80,354.75,2.5375999999999999E-5,1.2117,13.824,{"$f":"F643/E643","v":11.408764545679624}]
[36,81,392.61,2.7545000000000001E-5,1.2598,19.664000000000001,15.608826797904429]
[36,82,445.33,3.0994000000000002E-5,1.2799,25.390999999999998,19.838268614735526]
[36,83,499.26,3.5074000000000003E-5,1.2455000000000001,22.231999999999999,17.849859494179043]
[36,84,539.87,3.8544999999999998E-5,1.1991000000000001,16.462,13.728629805687598]
[36,85,567.77,4.1143999999999998E-5,1.1617,12.542,10.79624687957304]
[36,86,588.25,4.3170000000000002E-5,1.133,10.282,9.0750220653133269]
[36,87,604.32000000000005,4.4835E-5,1.1104000000000001,8.8414000000000001,7.9623559077809798]
[36,88,617.54,4.6254000000000001E-5,1.0919000000000001,7.8410000000000002,7.1810605366791824]
[36,89,628.75,4.7496000000000001E-5,1.0764,7.1054000000000004,6.6010776662950574]
[36,90,638.48,4.8602E-5,1.0631999999999999,6.5416999999999996,6.1528404815650868]
[36,91,647.09,4.9604000000000001E-5,1.0517000000000001,6.0956000000000001,5.7959494152324806]
[36,92,654.82000000000005,5.0522000000000002E-5,1.0418000000000001,5.7333999999999996,5.5033595699750428]
[36,93,661.84,5.1371E-5,1.0329999999999999,5.4329999999999998,5.2594385285575997]
[36,94,668.27,5.2163000000000002E-5,1.0253000000000001,5.1795999999999998,5.0517897200819268]
[36,95,674.21,5.2905000000000003E-5,1.0184,4.9626000000000001,4.8729379418695995]
[36,96,679.73,5.3606999999999997E-5,1.0122,4.7744999999999997,4.7169531713100179]
[36,97,684.9,5.4271000000000003E-5,1.0066999999999999,4.6097000000000001,4.5790205622330387]
[36,98,689.75,5.4904000000000002E-5,1.0017,4.4640000000000004,4.4564240790655889]
[36,99,694.33,5.5509E-5,0.99712000000000001,4.3339999999999996,4.3465179717586642]
[36,100,698.67,5.6088000000000002E-5,0.99295999999999995,4.2173999999999996,4.2473009990331931]
[36,101,702.8,5.6644999999999997E-5,0.98916000000000004,4.1120999999999999,4.1571636540094623]
[36,102,706.73,5.7182000000000002E-5,0.98565999999999998,4.0163000000000002,4.074731651888075]
[36,103,710.49,5.77E-5,0.98243000000000003,3.9289000000000001,3.9991653349348044]
[36,104,714.09,5.8201000000000001E-5,0.97945000000000004,3.8487,3.9294502016437796]
[36,105,717.55,5.8687000000000002E-5,0.97667999999999999,3.7747999999999999,3.864930171601753]
[36,106,720.87,5.9159000000000001E-5,0.97409999999999997,3.7065000000000001,3.8050508161379737]
[36,107,724.08,5.9617000000000002E-5,0.97170000000000001,3.6431,3.749202428733148]
[36,108,727.17,6.0062999999999997E-5,0.96945000000000003,3.5840000000000001,3.6969415648047863]
[36,109,730.16,6.0498000000000003E-5,0.96733999999999998,3.5289000000000001,3.6480451547542749]
[36,110,733.05,6.0922999999999999E-5,0.96535000000000004,3.4771999999999998,3.6020096338115706]
[36,111,735.86,6.1336999999999999E-5,0.96348999999999996,3.4287999999999998,3.5587292032091669]
[36,112,738.58,6.1742000000000006E-5,0.96172000000000002,3.3832,3.5178638273094038]
[36,113,741.22,6.2138999999999996E-5,0.96006000000000002,3.3401000000000001,3.4790533924963021]
[36,114,743.79,6.2527000000000006E-5,0.95848,3.2995000000000001,3.442429680327185]
[36,115,746.29,6.2908000000000001E-5,0.95698000000000005,3.2610000000000001,3.4075947250726242]
[36,116,748.73,6.3281000000000006E-5,0.95555999999999996,3.2244999999999999,3.3744610490183766]
[36,117,751.1,6.3646999999999996E-5,0.95421,3.1898,3.3428700181301809]
[36,118,753.42,6.4006999999999999E-5,0.95291999999999999,3.1566999999999998,3.3126600344205177]
[36,119,755.68,6.436E-5,0.95169000000000004,3.1252,3.2838424276812828]
[36,120,757.89,6.4708000000000005E-5,0.95050999999999997,3.0952000000000002,3.2563571135495684]
[36,121,760.06,6.5049999999999996E-5,0.94938999999999996,3.0663999999999998,3.2298633859636188]
[36,122,762.17,6.5386E-5,0.94830999999999999,3.0390000000000001,3.2046482690259515]
[36,123,764.24,6.5716999999999994E-5,0.94728000000000001,3.0125999999999999,3.1802634912591841]
[36,124,766.26,6.6044000000000007E-5,0.94628999999999996,2.9872999999999998,3.1568546640036352]
[36,125,768.25,6.6365000000000006E-5,0.94533999999999996,2.9630999999999998,3.1344278249095563]
[36,126,770.2,6.6681999999999996E-5,0.94442999999999999,2.9397000000000002,3.1126711349702996]
[36,127,772.11,6.6994000000000003E-5,0.94355,2.9173,3.0918340310529384]
[36,128,773.98,6.7303000000000003E-5,0.94271000000000005,2.8956,3.0715702602072747]
[36,129,775.82,6.7607000000000005E-5,0.94189000000000001,2.8748,3.052161080380936]
[36,130,777.62,6.7906999999999999E-5,0.94110000000000005,2.8546999999999998,3.0333652109233871]
[36,131,779.4,6.8204E-5,0.94035000000000002,2.8353000000000002,3.0151539320465783]
[36,132,781.14,6.8497000000000005E-5,0.93960999999999995,2.8165,2.9975202477623695]
[36,133,782.85,6.8786000000000002E-5,0.93891000000000002,2.7984,2.9804773620474805]
[36,134,784.54,6.9072999999999994E-5,0.93822000000000005,2.7808000000000002,2.9639103834921445]
[36,135,786.2,6.9355000000000003E-5,0.93755999999999995,2.7637999999999998,2.9478646699944537]
[36,136,787.83,6.9635000000000007E-5,0.93691999999999998,2.7473000000000001,2.9322674294496864]
[36,137,789.43,6.9912000000000004E-5,0.93630000000000002,2.7313000000000001,2.91712058101036]
[36,138,791.02,7.0185000000000006E-5,0.93569999999999998,2.7158000000000002,2.9024259912365076]
[36,139,792.57,7.0456000000000004E-5,0.93511999999999995,2.7008000000000001,2.8881854735221149]
[36,140,794.11,7.0723999999999996E-5,0.93454999999999999,2.6861999999999999,2.8743245412230483]
[36,141,795.62,7.0989999999999996E-5,0.93400000000000005,2.6720000000000002,2.8608137044967878]
[36,142,797.11,7.1252000000000002E-5,0.93347000000000002,2.6581999999999999,2.8476544505983052]
[36,143,798.58,7.1513000000000005E-5,0.93296000000000001,2.6448,2.8348482250042872]
[36,144,800.03,7.1769999999999999E-5,0.93245999999999996,2.6316999999999999,{"$f":"F707/E707","v":2.8223194560624587}]
[36,145,801.47,7.2026000000000005E-5,0.93196999999999997,2.6190000000000002,2.8101762932283232]
[36,146,802.88,7.2279000000000004E-5,0.93149999999999999,2.6065999999999998,2.7982823403113257]
[36,147,804.27,7.2529999999999998E-5,0.93103999999999998,2.5945,2.7866686715930573]
[36,148,805.65,7.2778E-5,0.93059000000000003,2.5828000000000002,2.7754435358213607]
[36,149,807,7.3023999999999997E-5,0.93015000000000003,2.5712999999999999,2.7643928398645379]
[36,150,808.34,7.3269000000000006E-5,0.92972999999999995,2.5600999999999998,2.7535951297688577]
[36,151,809.67,7.3510999999999995E-5,0.92932000000000003,2.5491999999999999,2.7430809624241377]
[36,152,810.98,7.3751000000000006E-5,0.92891999999999997,2.5385,2.7327434009387246]
[36,153,812.27,7.3990000000000001E-5,0.92852999999999997,2.5280999999999998,2.7226907046622078]
[36,154,813.55,7.4226000000000004E-5,0.92815000000000003,2.5179,2.7128158164089857]
[36,155,814.81,7.4461000000000004E-5,0.92778000000000005,2.5078999999999998,2.7031192739658105]
[36,156,816.06,7.4694E-5,0.92742000000000002,2.4982000000000002,2.6937094304630049]
[36,157,817.29,7.4925000000000005E-5,0.92706999999999995,2.4887000000000001,2.6844790576763353]
[36,158,818.51,7.5154000000000006E-5,0.92671999999999999,2.4794,2.6754575276243093]
[36,159,819.72,7.5382000000000004E-5,0.92639000000000005,2.4702999999999999,2.6665875063418212]
[36,160,820.91,7.5607999999999998E-5,0.92605999999999999,2.4613999999999998,2.6579271321512645]
[36,161,822.1,7.5833000000000004E-5,0.92574999999999996,2.4527000000000001,2.6494193896840401]
[36,162,823.26,7.6056000000000005E-5,0.92544000000000004,2.4441000000000002,2.6410140041493775]
[36,163,824.42,7.6277000000000002E-5,0.92513000000000001,2.4357000000000002,2.6328191713597011]
[36,164,825.57,7.6496999999999996E-5,0.92484,2.4275000000000002,2.6247783400371958]
[36,165,826.7,7.6715E-5,0.92454999999999998,2.4195000000000002,2.6169487858958416]
[36,166,827.82,7.6932000000000001E-5,0.92427000000000004,2.4116,2.609194283055817]
[36,167,828.93,7.7148000000000001E-5,0.92400000000000004,2.4039000000000001,2.6016233766233765]
[36,168,830.03,7.7361999999999996E-5,0.92373000000000005,2.3963000000000001,2.5941563010836499]
[36,169,831.12,7.7575000000000002E-5,0.92347000000000001,2.3889,2.586873423067344]
[36,170,832.2,7.7787000000000006E-5,0.92320999999999998,2.3816000000000002,2.5796947606720035]
[36,171,833.27,7.7997000000000006E-5,0.92296,2.3744000000000001,2.5725925283869291]
[36,172,834.33,7.8206000000000003E-5,0.92271999999999998,2.3673999999999999,2.5656753944858677]
[36,173,835.38,7.8413999999999998E-5,0.92247999999999997,2.3605,2.5588630647818924]
[36,174,836.42,7.8620000000000003E-5,0.92225000000000001,2.3536999999999999,2.5521279479533749]
[36,175,837.45,7.8825999999999994E-5,0.92203000000000002,2.3471000000000002,2.5455787772632128]
[36,176,838.47,7.9029999999999994E-5,0.92179999999999995,2.3405,2.5390540247342157]
[36,177,839.48,7.9233000000000005E-5,0.92159000000000002,2.3340999999999998,2.5326880717021667]
[36,178,840.48,7.9435000000000001E-5,0.92137999999999998,2.3277999999999999,2.526427749679828]
[36,179,841.48,7.9635999999999994E-5,0.92117000000000004,2.3216000000000001,2.520273130909604]
[36,180,842.47,7.9835999999999999E-5,0.92096999999999996,2.3155000000000001,2.5141969879583486]
[36,181,843.44,8.0034E-5,0.92076999999999998,2.3094999999999999,2.5082268101697491]
[36,182,844.41,8.0232E-5,0.92057999999999995,2.3035999999999999,2.5023354841512959]
[36,183,845.38,8.0428999999999999E-5,0.92039000000000004,2.2978000000000001,2.4965503753843481]
[36,184,846.33,8.0624000000000006E-5,0.92020999999999997,2.2919999999999998,2.4907358103041695]
[36,185,847.28,8.0819E-5,0.92003000000000001,2.2864,2.4851363542493181]
[36,186,848.21,8.1012000000000003E-5,0.91984999999999995,2.2808999999999999,2.4796434201228461]
[36,187,849.15,8.1205000000000006E-5,0.91968000000000005,2.2753999999999999,2.4741214335421011]
[36,188,850.07,8.1396999999999993E-5,0.91951000000000005,2.2700999999999998,2.4688149122902412]
[36,189,850.99,8.1588000000000006E-5,0.91935,2.2648000000000001,2.4634796323489425]
[36,190,851.9,8.1778000000000002E-5,0.91918999999999995,2.2595999999999998,2.4582512864587298]
[36,191,852.8,8.1966999999999996E-5,0.91903000000000001,2.2545000000000002,2.4531299304701699]
[36,192,853.7,8.2155000000000002E-5,0.91888000000000003,2.2494000000000001,2.4479801497475187]
[36,193,854.59,8.2342000000000005E-5,0.91873000000000005,2.2444999999999999,2.4430463792409083]
[36,194,855.47,8.2528000000000007E-5,0.91857999999999995,2.2395999999999998,2.4381109974090442]
[36,195,856.35,8.2713999999999994E-5,0.91844000000000003,2.2347000000000001,2.4331475109969078]
[36,196,857.22,8.2898999999999994E-5,0.91830000000000001,2.23,2.428400304911249]
[36,197,858.08,8.3083000000000004E-5,0.91815999999999998,2.2252999999999998,2.4236516511283437]
[36,198,858.94,8.3265999999999999E-5,0.91803000000000001,2.2206999999999999,2.4189841290589631]
[36,199,859.79,8.3448000000000005E-5,0.91790000000000005,2.2161,2.4143152848894212]
[36,200,860.63,8.3629999999999997E-5,0.91776999999999997,2.2115999999999998,2.4097540778190614]
[37,74,242.23,2.0373E-5,1.0062,4.0392000000000001,4.0143112701252237]
[37,75,252.07,2.0737000000000002E-5,1.0225,4.4345999999999997,4.337017114914425]
[37,76,262.93,2.1155999999999999E-5,1.0407,4.9276,4.7348899778994911]
[37,77,275.08,2.1645E-5,1.0609999999999999,5.5580999999999996,5.2385485391140429]
[37,78,288.89999999999998,2.2229E-5,1.0841000000000001,6.3883999999999999,5.8928143160225064]
[37,79,304.93,2.2943999999999999E-5,1.1106,7.5194000000000001,6.7705744642535564]
[37,80,324.02,2.3849000000000002E-5,1.1412,9.1168999999999993,7.988871363477041]
[37,81,347.48,2.5041999999999998E-5,1.1763999999999999,11.444000000000001,{"$f":"F771/E771","v":9.7279836790207437}]
[37,82,377.33,2.6693E-5,1.2144999999999999,14.877000000000001,12.249485384932072]
[37,83,416.17,2.9076000000000001E-5,1.2445999999999999,19.312000000000001,15.516631849590231]
[37,84,461.99,3.2243999999999998E-5,1.2442,20.513000000000002,16.486899212345286]
[37,85,504.09,3.5518000000000001E-5,1.2168000000000001,18.061,14.843030900723207]
[37,86,537.45000000000005,3.8376E-5,1.1828000000000001,14.493,12.253128170443016]
[37,87,562.41999999999996,4.0677999999999999E-5,1.1520999999999999,11.706,10.160576338859475]
[37,88,581.70000000000005,4.2555999999999997E-5,1.1267,9.8767999999999994,8.7661311795509]
[37,89,597.27,4.4141000000000003E-5,1.1056999999999999,8.6335999999999995,7.8082662566699828]
[37,90,610.29999999999995,4.5515E-5,1.0882000000000001,7.7361000000000004,7.1090792133798937]
[37,91,621.48,4.6730000000000002E-5,1.0733999999999999,7.0571999999999999,6.5746226942425938]
[37,92,631.26,4.7821000000000002E-5,1.0607,6.5255999999999998,6.1521636655039122]
[37,93,639.96,4.8814999999999999E-5,1.0496000000000001,6.0982000000000003,5.8100228658536581]
[37,94,647.79999999999995,4.9728000000000002E-5,1.04,5.7469999999999999,5.5259615384615381]
[37,95,654.92999999999995,5.0575999999999998E-5,1.0315000000000001,5.4531000000000001,5.2865729520116336]
[37,96,661.48,5.1366999999999998E-5,1.0239,5.2032999999999996,5.0818439300712956]
[37,97,667.53,5.2111000000000003E-5,1.0172000000000001,4.9882,4.9038537160833657]
[37,98,673.17,5.2814E-5,1.0112000000000001,4.8009000000000004,4.747725474683544]
[37,99,678.44,5.3480999999999998E-5,1.0058,4.6361999999999997,4.6094651024060447]
[37,100,683.4,5.4116000000000002E-5,1.0008999999999999,4.4901,4.4860625437106609]
[37,101,688.08,5.4724E-5,0.99639,4.3594999999999997,4.3752948142795489]
[37,102,692.52,5.5306000000000002E-5,0.99229999999999996,4.2420999999999998,4.275017635795626]
[37,103,696.73,5.5865999999999997E-5,0.98855999999999999,4.1357999999999997,4.1836610827870837]
[37,104,700.75,5.6405E-5,0.98512,4.0392000000000001,4.100211141789833]
[37,105,704.59,5.6925999999999997E-5,0.98194000000000004,3.9508000000000001,4.023463755422938]
[37,106,708.27,5.7429999999999997E-5,0.97899999999999998,3.8696000000000002,3.9526046986721148]
[37,107,711.8,5.7917999999999997E-5,0.97626999999999997,3.7948,3.8870394460548825]
[37,108,715.2,5.8391999999999999E-5,0.97372999999999998,3.7254999999999998,3.8260092633481557]
[37,109,718.47,5.8853E-5,0.97136,3.6612,3.7691484104760336]
[37,110,721.63,5.9302000000000002E-5,0.96913000000000005,3.6013999999999999,3.7161165168759607]
[37,111,724.68,5.9738999999999998E-5,0.96704999999999997,3.5453999999999999,3.6662013339537771]
[37,112,727.63,6.0164999999999997E-5,0.96509,3.4931000000000001,3.6194551803458745]
[37,113,730.49,6.0581999999999997E-5,0.96323999999999999,3.4439000000000002,3.5753290976288361]
[37,114,733.27,6.0989000000000002E-5,0.96150000000000002,3.3976000000000002,3.5336453458138326]
[37,115,735.96,6.1387E-5,0.95984999999999998,3.3540000000000001,3.4942959837474605]
[37,116,738.59,6.1777000000000002E-5,0.95828000000000002,3.3127,3.4569228200525943]
[37,117,741.14,6.2158999999999999E-5,0.95679999999999998,3.2736999999999998,3.4215091973244145]
[37,118,743.62,6.2533999999999995E-5,0.95538999999999996,3.2366000000000001,3.3877264781921523]
[37,119,746.04,6.2902000000000002E-5,0.95404999999999995,3.2014,3.3555893296997015]
[37,120,748.4,6.3262999999999994E-5,0.95277000000000001,3.1678999999999999,3.3249367633321789]
[37,121,750.71,6.3618E-5,0.95155000000000001,3.1360000000000001,3.295675476853555]
[37,122,752.96,6.3967000000000006E-5,0.95038,3.1055000000000001,3.2676403122961344]
[37,123,755.16,6.4309999999999999E-5,0.94925999999999999,3.0764,3.2408402334449993]
[37,124,757.31,6.4647000000000006E-5,0.94818999999999998,3.0485000000000002,3.2150729284215194]
[37,125,759.42,6.4980000000000005E-5,0.94716999999999996,3.0217999999999998,3.1903459780187293]
[37,126,761.48,6.5307000000000003E-5,0.94618000000000002,2.9962,3.1666279143503351]
[37,127,763.5,6.5629999999999993E-5,0.94523000000000001,2.9716,3.1437851105022059]
[37,128,765.48,6.5947999999999999E-5,0.94432000000000005,2.948,3.1218231108098946]
[37,129,767.42,6.6260999999999995E-5,0.94345000000000001,2.9253,3.1006412634479834]
[37,130,769.33,6.6570999999999997E-5,0.94259999999999999,2.9034,3.080203691915977]
[37,131,771.2,6.6876000000000001E-5,0.94179000000000002,2.8822999999999999,3.060448719990656]
[37,132,773.04,6.7176999999999997E-5,0.94101000000000001,2.8618999999999999,3.0413066811192229]
[37,133,774.84,6.7473999999999998E-5,0.94025000000000003,2.8422999999999998,3.0229194363201275]
[37,134,776.61,6.7768000000000006E-5,0.93952000000000002,2.8233000000000001,3.0050451294277929]
[37,135,778.35,6.8058999999999993E-5,0.93881000000000003,2.8050000000000002,2.9878250125158448]
[37,136,780.07,6.8344999999999997E-5,0.93811999999999995,2.7871999999999999,2.9710484799386006]
[37,137,781.75,6.8628999999999996E-5,0.93745999999999996,2.77,2.9547927378234804]
[37,138,783.41,6.8909E-5,0.93681999999999999,2.7532999999999999,2.9389850771759782]
[37,139,785.04,6.9187E-5,0.93620000000000003,2.7372000000000001,2.923734244819483]
[37,140,786.65,6.9461000000000005E-5,0.93559999999999999,2.7214999999999998,2.9088285592133389]
[37,141,788.23,6.9732000000000003E-5,0.93501999999999996,2.7063000000000001,2.8943765908750616]
[37,142,789.79,7.0000999999999996E-5,0.93445,2.6916000000000002,2.880410936914763]
[37,143,791.33,7.0266999999999997E-5,0.93389999999999995,2.6772,2.8666880822357856]
[37,144,792.84,7.0530000000000004E-5,0.93337000000000003,2.6633,2.8534236155008195]
[37,145,794.34,7.0790999999999994E-5,0.93284999999999996,2.6497000000000002,{"$f":"F835/E835","v":2.8404352253845744}]
[37,146,795.81,7.1049000000000004E-5,0.93235000000000001,2.6364999999999998,2.8278007186142542]
[37,147,797.26,7.1304999999999996E-5,0.93186000000000002,2.6236999999999999,2.8155516923142958]
[37,148,798.7,7.1558999999999997E-5,0.93137999999999999,2.6112000000000002,2.8035817818720612]
[37,149,800.11,7.1810000000000005E-5,0.93091999999999997,2.5990000000000002,2.7918618141193661]
[37,150,801.51,7.2058999999999996E-5,0.93047000000000002,2.5871,2.7804227970810449]
[37,151,802.88,7.2305999999999995E-5,0.93003999999999998,2.5754999999999999,2.7692357317964817]
[37,152,804.25,7.2550000000000002E-5,0.92961000000000005,2.5642,2.7583610331214166]
[37,153,805.59,7.2793000000000006E-5,0.92920000000000003,2.5531999999999999,2.7477399913904432]
[37,154,806.92,7.3034000000000006E-5,0.92879,2.5424000000000002,2.7373249065989085]
[37,155,808.23,7.3271999999999999E-5,0.9284,2.5318999999999998,2.7271650150797067]
[37,156,809.52,7.3509000000000004E-5,0.92801999999999996,2.5215999999999998,2.7171828193357901]
[37,157,810.81,7.3744000000000004E-5,0.92764999999999997,2.5116000000000001,2.7074866598393794]
[37,158,812.07,7.3977E-5,0.92727999999999999,2.5017999999999998,2.697998447071003]
[37,159,813.32,7.4208999999999994E-5,0.92693000000000003,2.4922,2.6886604166441908]
[37,160,814.56,7.4437999999999994E-5,0.92657999999999996,2.4828000000000001,2.6795311791750311]
[37,161,815.79,7.4666000000000006E-5,0.92625000000000002,2.4735999999999998,2.6705533063427795]
[37,162,817,7.4893000000000003E-5,0.92591999999999997,2.4645999999999999,2.6617850354242267]
[37,163,818.19,7.5117000000000006E-5,0.92559999999999998,2.4558,2.6531979256698359]
[37,164,819.38,7.5339999999999994E-5,0.92528999999999995,2.4472,2.6447924434501617]
[37,165,820.55,7.5562000000000006E-5,0.92498000000000002,2.4386999999999999,2.6364894376094616]
[37,166,821.71,7.5782000000000001E-5,0.92467999999999995,2.4304999999999999,2.6284768784876928]
[37,167,822.86,7.6001000000000006E-5,0.92439000000000004,2.4222999999999999,2.6204307705622085]
[37,168,824,7.6217999999999994E-5,0.92410999999999999,2.4144000000000001,2.6126759801322357]
[37,169,825.12,7.6433999999999994E-5,0.92383999999999999,2.4066000000000001,2.6049965361967442]
[37,170,826.24,7.6648000000000002E-5,0.92357,2.399,2.5975291531773443]
[37,171,827.34,7.6860999999999995E-5,0.92330000000000001,2.3915000000000002,2.5901657099534279]
[37,172,828.44,7.7072999999999999E-5,0.92303999999999997,2.3841000000000001,2.5828783151326054]
[37,173,829.52,7.7282999999999999E-5,0.92279,2.3769,2.575775636927145]
[37,174,830.59,7.7491999999999996E-5,0.92254999999999998,2.3698000000000001,2.5687496612649721]
[37,175,831.65,7.7700000000000005E-5,0.92230999999999996,2.3628,2.5618284524725961]
[37,176,832.71,7.7906999999999998E-5,0.92206999999999995,2.3559999999999999,2.5551205439934059]
[37,177,833.75,7.8112E-5,0.92184999999999995,2.3492999999999999,2.5484623311818626]
[37,178,834.78,7.8316E-5,0.92161999999999999,2.3426999999999998,2.5419370239361121]
[37,179,835.81,7.8518999999999998E-5,0.9214,2.3361999999999998,2.535489472541784]
[37,180,836.83,7.8720999999999994E-5,0.92118999999999995,2.3298999999999999,2.5292284979211672]
[37,181,837.83,7.8922000000000001E-5,0.92098000000000002,2.3235999999999999,2.5229646680709679]
[37,182,838.83,7.9122000000000006E-5,0.92078000000000004,2.3174999999999999,2.5168878559482177]
[37,183,839.82,7.9320999999999995E-5,0.92057999999999995,2.3113999999999999,2.5108084033978577]
[37,184,840.8,7.9518000000000007E-5,0.92037999999999998,2.3054000000000001,2.5048349594732611]
[37,185,841.78,7.9715000000000005E-5,0.92018999999999995,2.2995999999999999,2.499049109423054]
[37,186,842.74,7.9909999999999999E-5,0.92000999999999999,2.2938000000000001,2.4932337691981608]
[37,187,843.7,8.0105000000000006E-5,0.91983000000000004,2.2881999999999998,2.4876335844666948]
[37,188,844.65,8.0298999999999998E-5,0.91964999999999997,2.2826,2.4820312075246016]
[37,189,845.59,8.0490999999999999E-5,0.91947000000000001,2.2770999999999999,2.4765353953908229]
[37,190,846.53,8.0683E-5,0.91930000000000001,2.2717000000000001,2.4711193299249428]
[37,191,847.46,8.0873999999999999E-5,0.91913999999999996,2.2664,2.4657832321517943]
[37,192,848.38,8.1063999999999995E-5,0.91898000000000002,2.2610999999999999,2.4604452762845761]
[37,193,849.29,8.1252000000000001E-5,0.91881999999999997,2.2559999999999998,2.455323131843016]
[37,194,850.2,8.1440999999999995E-5,0.91866000000000003,2.2509000000000001,2.450199203187251]
[37,195,851.1,8.1627999999999998E-5,0.91851000000000005,2.2458999999999998,2.4451557413637302]
[37,196,851.99,8.1814E-5,0.91835999999999995,2.2410000000000001,2.4402195217561742]
[37,197,852.88,8.1998999999999999E-5,0.91822000000000004,2.2361,2.4352551676068916]
[37,198,853.76,8.2183999999999998E-5,0.91807000000000005,2.2313000000000001,2.4304246952846733]
[37,199,854.63,8.2367999999999995E-5,0.91793999999999998,2.2265999999999999,2.4256487352114515]
[37,200,855.5,8.2551000000000003E-5,0.91779999999999995,2.2219000000000002,2.4208977990847682]
[38,74,235.4,2.0183999999999999E-5,0.98753999999999997,3.6718999999999999,3.7182291350223791]
[38,75,244.24,2.0502000000000001E-5,1.0013000000000001,3.9735999999999998,3.9684410266653347]
[38,76,253.85,2.086E-5,1.0163,4.3368000000000002,4.2672439240381781]
[38,77,264.39,2.1268E-5,1.0327999999999999,4.7816000000000001,4.6297443841982959]
[38,78,276.07,2.1741000000000001E-5,1.0509999999999999,5.3368000000000002,5.0778306374881073]
[38,79,289.18,2.2296000000000001E-5,1.0711999999999999,6.0453000000000001,5.6434839432412254]
[38,80,304.14,2.2963E-5,1.0939000000000001,6.9702999999999999,6.371971843861413]
[38,81,321.52999999999997,2.3782E-5,1.1194,8.2049000000000003,7.3297302126139012]
[38,82,342.14,2.4817E-5,1.1477999999999999,9.8770000000000007,{"$f":"F899/E899","v":8.6051576929778726}]
[38,83,367.1,2.6163999999999999E-5,1.1781999999999999,12.14,10.303853335596674]
[38,84,397.77,2.7966999999999998E-5,1.2061999999999999,15.035,12.464765378875809]
[38,85,434.5,3.0348000000000001E-5,1.2208000000000001,17.445,14.28980996068152]
[38,86,472.76,3.3098000000000001E-5,1.2137,17.068000000000001,14.062783224849634]
[38,87,507.09,3.5814E-5,1.1919999999999999,15.3,12.835570469798659]
[38,88,535.39,3.824E-5,1.1656,12.941000000000001,11.102436513383665]
[38,89,557.86,4.0293000000000002E-5,1.1402000000000001,10.920999999999999,9.5781441852306592]
[38,90,575.92999999999995,4.2030999999999998E-5,1.1178999999999999,9.4487000000000005,8.4521871365954038]
[38,91,590.91,4.3531E-5,1.0989,8.3849,7.6302666302666307]
[38,92,603.64,4.4851999999999997E-5,1.0827,7.5885999999999996,7.0089590837720506]
[38,93,614.70000000000005,4.6032999999999998E-5,1.0688,6.9705000000000004,6.5218001497005993]
[38,94,624.45000000000005,4.7101999999999997E-5,1.0568,6.4767999999999999,6.1286903860711579]
[38,95,633.17999999999995,4.8081000000000003E-5,1.0463,6.0734000000000004,5.8046449393099495]
[38,96,641.08000000000004,4.8986000000000002E-5,1.0371999999999999,5.7377000000000002,5.5319128422676442]
[38,97,648.29,4.9827000000000003E-5,1.0289999999999999,5.4538000000000002,5.3000971817298357]
[38,98,654.91999999999996,5.0615000000000002E-5,1.0218,5.2107000000000001,5.0995302407516148]
[38,99,661.07,5.1357999999999999E-5,1.0154000000000001,4.9999000000000002,4.9240693322828442]
[38,100,666.79,5.206E-5,1.0096000000000001,4.8154000000000003,4.7696117274167991]
[38,101,672.16,5.2726999999999998E-5,1.0043,4.6524000000000001,4.6324803345613859]
[38,102,677.21,5.3362999999999997E-5,0.99956,4.5072999999999999,4.5092840849973985]
[38,103,681.97,5.3971000000000002E-5,0.99522999999999995,4.3773,4.3982797946203389]
[38,104,686.49,5.4555000000000002E-5,0.99126999999999998,4.26,4.2975173262582347]
[38,105,690.79,5.5115999999999999E-5,0.98763000000000001,4.1536,4.205623563480251]
[38,106,694.88,5.5656999999999999E-5,0.98428000000000004,4.0567000000000002,4.121489819969927]
[38,107,698.8,5.6180000000000001E-5,0.98118000000000005,3.9679000000000002,4.0440082349823685]
[38,108,702.55,5.6684999999999997E-5,0.97831000000000001,3.8862999999999999,3.9724627163169135]
[38,109,706.15,5.7175000000000001E-5,0.97565000000000002,3.8109000000000002,3.9060113770306977]
[38,110,709.61,5.7651000000000001E-5,0.97316000000000003,3.7410999999999999,3.8442804883061363]
[38,111,712.94,5.8114E-5,0.97082999999999997,3.6762999999999999,3.7867597828662074]
[38,112,716.16,5.8563999999999997E-5,0.96865000000000001,3.6158000000000001,3.732824033448614]
[38,113,719.27,5.9002999999999997E-5,0.96660999999999997,3.5594000000000001,3.6823537931533918]
[38,114,722.28,5.9431000000000001E-5,0.96467999999999998,3.5064000000000002,3.6347804453290213]
[38,115,725.2,5.9849000000000002E-5,0.96287,3.4567000000000001,3.5899965727460614]
[38,116,728.03,6.0257000000000003E-5,0.96114999999999995,3.4098999999999999,3.5477292826301827]
[38,117,730.77,6.0656999999999999E-5,0.95952999999999999,3.3658000000000001,3.5077590070138509]
[38,118,733.44,6.1048000000000002E-5,0.95799000000000001,3.3241000000000001,3.4698692053152955]
[38,119,736.04,6.1432000000000004E-5,0.95652000000000004,3.2846000000000002,3.4339062434658971]
[38,120,738.57,6.1808000000000002E-5,0.95513000000000003,3.2471000000000001,3.3996419335587826]
[38,121,741.03,6.2176999999999998E-5,0.95379999999999998,3.2115,3.3670580834556514]
[38,122,743.43,6.2539000000000006E-5,0.95254000000000005,3.1776,3.3359229008755538]
[38,123,745.78,6.2895E-5,0.95133000000000001,3.1453000000000002,3.3062134064940665]
[38,124,748.07,6.3244999999999995E-5,0.95016999999999996,3.1145,3.2778344927749772]
[38,125,750.31,6.3589000000000004E-5,0.94906999999999997,3.0851000000000002,3.250655905254618]
[38,126,752.5,6.3928000000000002E-5,0.94801000000000002,3.0569000000000002,3.2245440448940412]
[38,127,754.64,6.4261E-5,0.94699,3.0299,3.1995058025955925]
[38,128,756.74,6.4590000000000003E-5,0.94601000000000002,3.004,3.1754421200621556]
[38,129,758.8,6.4912999999999993E-5,0.94506999999999997,2.9792000000000001,3.1523590845122587]
[38,130,760.81,6.5232000000000002E-5,0.94416,2.9552999999999998,3.1300838840874428]
[38,131,762.78,6.5545999999999999E-5,0.94328999999999996,2.9323000000000001,3.1085880270118418]
[38,132,764.72,6.5856000000000001E-5,0.94245000000000001,2.9102000000000001,3.0879091729004191]
[38,133,766.62,6.6161999999999994E-5,0.94164000000000003,2.8889,3.0679452869461787]
[38,134,768.49,6.6464000000000006E-5,0.94086000000000003,2.8683000000000001,3.0485938396785919]
[38,135,770.32,6.6761999999999995E-5,0.94010000000000005,2.8485,3.0299968088501221]
[38,136,772.12,6.7057000000000005E-5,0.93937000000000004,2.8292999999999999,3.0119122390538338]
[38,137,773.89,6.7348000000000006E-5,0.93867,2.8107000000000002,2.9943430598612935]
[38,138,775.63,6.7634999999999999E-5,0.93798000000000004,2.7928000000000002,2.977462206017186]
[38,139,777.34,6.792E-5,0.93732000000000004,2.7753999999999999,2.9609951777407928]
[38,140,779.03,6.8200000000000004E-5,0.93667999999999996,2.7585999999999999,2.9450826322756973]
[38,141,780.69,6.8478000000000004E-5,0.93606,2.7423000000000002,2.9296198961605029]
[38,142,782.32,6.8752999999999997E-5,0.93545999999999996,2.7265000000000001,2.9146088555363141]
[38,143,783.93,6.9024999999999997E-5,0.93488000000000004,2.7111999999999998,2.900051343487934]
[38,144,785.51,6.9294000000000004E-5,0.93430999999999997,2.6962999999999999,2.8858729971850883]
[38,145,787.07,6.9560999999999993E-5,0.93376000000000003,2.6818,2.8720442083618916]
[38,146,788.61,6.9824000000000001E-5,0.93323,2.6677,{"$f":"F963/E963","v":2.8585664841464591}]
[38,147,790.12,7.0086000000000006E-5,0.93271000000000004,2.6539999999999999,2.8454717972360108]
[38,148,791.62,7.0344000000000003E-5,0.93220000000000003,2.6406999999999998,2.8327612100407635]
[38,149,793.09,7.0599999999999995E-5,0.93171000000000004,2.6278000000000001,2.8204054909789527]
[38,150,794.55,7.0853999999999996E-5,0.93123999999999996,2.6151,2.8081912288991022]
[38,151,795.98,7.1106000000000007E-5,0.93076999999999999,2.6029,2.7965018210728751]
[38,152,797.4,7.1354999999999997E-5,0.93032000000000004,2.5909,2.7849557141628685]
[38,153,798.79,7.1601999999999996E-5,0.92988000000000004,2.5792000000000002,2.7736912289757818]
[38,154,800.17,7.1847000000000005E-5,0.92945999999999995,2.5678000000000001,2.762679405246057]
[38,155,801.54,7.2089999999999996E-5,0.92903999999999998,2.5567000000000002,2.7519805390510639]
[38,156,802.88,7.2330999999999996E-5,0.92864000000000002,2.5457999999999998,2.741428325292901]
[38,157,804.21,7.2570000000000005E-5,0.92823999999999995,2.5352000000000001,2.7311902094285965]
[38,158,805.53,7.2806999999999996E-5,0.92786000000000002,2.5247999999999999,2.7211001659733149]
[38,159,806.83,7.3041999999999996E-5,0.92747999999999997,2.5146999999999999,2.7113253115970157]
[38,160,808.11,7.3275999999999994E-5,0.92712000000000006,2.5047999999999999,2.701699887824661]
[38,161,809.38,7.3506999999999999E-5,0.92676000000000003,2.4952000000000001,2.6923906944624281]
[38,162,810.63,7.3737000000000002E-5,0.92640999999999996,2.4857,2.6831532474822164]
[38,163,811.87,7.3965000000000001E-5,0.92606999999999995,2.4763999999999999,2.6740959106762987]
[38,164,813.1,7.4191999999999997E-5,0.92574000000000001,2.4674,2.6653271977012984]
[38,165,814.32,7.4417000000000003E-5,0.92542000000000002,2.4584999999999999,2.6566315834972225]
[38,166,815.52,7.4640000000000004E-5,0.92510999999999999,2.4498000000000002,2.6481175211596462]
[38,167,816.7,7.4862000000000003E-5,0.92479999999999996,2.4413,2.6398140138408306]
[38,168,817.88,7.5081999999999997E-5,0.92449999999999999,2.4329999999999998,2.6316928069226608]
[38,169,819.04,7.5300000000000001E-5,0.92420999999999998,2.4247999999999998,2.6236461410285541]
[38,170,820.2,7.5518000000000004E-5,0.92391999999999996,2.4167999999999998,2.6158108927179842]
[38,171,821.34,7.5734000000000004E-5,0.92364999999999997,2.4089,2.6080225193525686]
[38,172,822.47,7.5947999999999999E-5,0.92337000000000002,2.4011999999999998,2.6004743493940672]
[38,173,823.58,7.6161000000000005E-5,0.92310999999999999,2.3936999999999999,2.5930820812254227]
[38,174,824.69,7.6372999999999995E-5,0.92284999999999995,2.3862999999999999,2.5857940076935582]
[38,175,825.79,7.6582999999999995E-5,0.92259000000000002,2.379,2.5786102168894089]
[38,176,826.87,7.6792000000000006E-5,0.92235,2.3719000000000001,2.5715834553043857]
[38,177,827.95,7.7000000000000001E-5,0.92210999999999999,2.3649,2.5646614829033414]
[38,178,829.02,7.7206999999999994E-5,0.92186999999999997,2.3580000000000001,2.5578443815288492]
[38,179,830.07,7.7411999999999997E-5,0.92164000000000001,2.3512,2.5511045527537868]
[38,180,831.12,7.7616999999999999E-5,0.92140999999999995,2.3445999999999998,2.5445784178595847]
[38,181,832.16,7.7819999999999997E-5,0.92118999999999995,2.3380000000000001,2.5380214722261423]
[38,182,833.19,7.8022000000000006E-5,0.92098000000000002,2.3315999999999999,2.53165106734131]
[38,183,834.21,7.8223E-5,0.92076999999999998,2.3252999999999999,2.5253863614149026]
[38,184,835.22,7.8422000000000002E-5,0.92056000000000004,2.3191000000000002,2.5192274267836972]
[38,185,836.22,7.8621000000000005E-5,0.92035999999999996,2.3130000000000002,2.5131470294232696]
[38,186,837.21,7.8818000000000003E-5,0.92015999999999998,2.3071000000000002,2.5072813423752391]
[38,187,838.2,7.9015000000000002E-5,0.91996999999999995,2.3012000000000001,2.5013859147580901]
[38,188,839.18,7.9210999999999998E-5,0.91978000000000004,2.2953999999999999,2.4955967731414033]
[38,189,840.14,7.9405000000000003E-5,0.91959999999999997,2.2896999999999998,2.4898869073510221]
[38,190,841.11,7.9598999999999995E-5,0.91942000000000002,2.2839999999999998,2.4841748058558655]
[38,191,842.06,7.9790999999999996E-5,0.91923999999999995,2.2785000000000002,2.4786780383795315]
[38,192,843.01,7.9982999999999996E-5,0.91907000000000005,2.2730999999999999,2.4732610138509576]
[38,193,843.94,8.0173000000000006E-5,0.91890000000000005,2.2677,2.4678419849820439]
[38,194,844.88,8.0363000000000003E-5,0.91874,2.2624,2.4625029932298581]
[38,195,845.8,8.0551999999999997E-5,0.91857999999999995,2.2572000000000001,2.4572710052472297]
[38,196,846.72,8.0740000000000003E-5,0.91842000000000001,2.2521,2.4521460769582544]
[38,197,847.63,8.0927000000000006E-5,0.91827000000000003,2.2471000000000001,2.4471016149934117]
[38,198,848.53,8.1112999999999994E-5,0.91812000000000005,2.2421000000000002,2.4420555047270511]
[38,199,849.43,8.1298000000000007E-5,0.91796999999999995,2.2372000000000001,2.4371166813730296]
[38,200,850.32,8.1483000000000006E-5,0.91783000000000003,2.2324000000000002,2.4322586971443516]
[39,74,229.41,2.0030999999999998E-5,0.9718,3.3872,3.4854908417369828]
[39,75,237.48,2.0313E-5,0.98370999999999997,3.6267999999999998,3.6868589320023175]
[39,76,246.16,2.0627000000000001E-5,0.99651000000000001,3.9079000000000002,3.9215863363137351]
[39,77,255.54,2.0979E-5,1.0103,4.2416999999999998,4.1984559041868748]
[39,78,265.76,2.1378000000000001E-5,1.0253000000000001,4.6436999999999999,4.5291134302155465]
[39,79,277,2.1835E-5,1.0416000000000001,5.1349999999999998,4.929915514592933]
[39,80,289.49,2.2365E-5,1.0593999999999999,5.7449000000000003,5.4227864829148587]
[39,81,303.52999999999997,2.2989999999999998E-5,1.079,6.5141,6.0371640407784986]
[39,82,319.52999999999997,2.374E-5,1.1004,7.4965000000000002,6.8125227190112687]
[39,83,338.01,2.4658E-5,1.1237999999999999,8.7576000000000001,{"$f":"F1027/E1027","v":7.7928457020822215}]
[39,84,359.64,2.5805000000000001E-5,1.1484000000000001,10.364000000000001,9.0247300592128177]
[39,85,385.19,2.7260999999999999E-5,1.1720999999999999,12.339,10.527258766316868]
[39,86,415.1,2.9111999999999998E-5,1.1899,14.372999999999999,12.079166316497185]
[39,87,448.03,3.1340000000000001E-5,1.1949000000000001,15.295,12.800234329232572]
[39,88,480.17,3.3714000000000003E-5,1.1860999999999999,14.645,12.34718826405868]
[39,89,509.05,3.6025999999999997E-5,1.1685000000000001,13.327,11.405220367993152]
[39,90,533.61,3.8130000000000003E-5,1.1474,11.688000000000001,10.186508628202894]
[39,91,553.94000000000005,3.9974E-5,1.1264000000000001,10.196999999999999,9.0527343749999982]
[39,92,570.85,4.1581000000000001E-5,1.1073,9.0161999999999995,8.1425088052018424]
[39,93,585.16999999999996,4.2996E-5,1.0904,8.1125000000000007,7.4399303008070437]
[39,94,597.54999999999995,4.4258999999999998E-5,1.0757000000000001,7.4114000000000004,6.889839174491029]
[39,95,608.41,4.5401000000000001E-5,1.0629,6.8540000000000001,6.4483958980148657]
[39,96,618.07000000000005,4.6443000000000002E-5,1.0518000000000001,6.4004000000000003,6.0851872979653923]
[39,97,626.77,4.7403E-5,1.0421,6.0240999999999998,5.780731215814221]
[39,98,634.67999999999995,4.8294000000000002E-5,1.0335000000000001,5.7069999999999999,5.5220125786163514]
[39,99,641.92999999999995,4.9125999999999997E-5,1.0258,5.4360999999999997,5.2993760967050099]
[39,100,648.61,4.9907000000000002E-5,1.0189999999999999,5.2020999999999997,5.105103042198234]
[39,101,654.82000000000005,5.0645E-5,1.0128999999999999,4.9977999999999998,4.9341494718136047]
[39,102,660.62,5.1344000000000002E-5,1.0074000000000001,4.8178000000000001,4.7824101647806234]
[39,103,666.06,5.2009000000000003E-5,1.0024,4.6581000000000001,4.6469473264166004]
[39,104,671.18,5.2643999999999999E-5,0.99785000000000001,4.5152999999999999,4.525028811945683]
[39,105,676.02,5.3251999999999998E-5,0.99370000000000003,4.3868999999999998,4.414712689946664]
[39,106,680.61,5.3835000000000002E-5,0.9899,4.2706999999999997,4.31427416910799]
[39,107,684.97,5.4397000000000001E-5,0.98640000000000005,4.165,4.2224249797242495]
[39,108,689.14,5.4938000000000002E-5,0.98316999999999999,4.0685000000000002,4.1381449800136298]
[39,109,693.12,5.5461000000000003E-5,0.98018000000000005,3.9799000000000002,4.0603766655104163]
[39,110,696.93,5.5967999999999997E-5,0.97741,3.8982999999999999,3.9883979087588628]
[39,111,700.59,5.6459000000000003E-5,0.97482000000000002,3.8229000000000002,3.9216470733058411]
[39,112,704.12,5.6935999999999998E-5,0.97241,3.7528999999999999,3.8593803025472795]
[39,113,707.51,5.7398999999999997E-5,0.97014999999999996,3.6878000000000002,3.8012678451785811]
[39,114,710.78,5.7849999999999997E-5,0.96802999999999995,3.6271,3.7468880096691222]
[39,115,713.95,5.8289999999999999E-5,0.96603000000000006,3.5703999999999998,3.6959514714863921]
[39,116,717.01,5.8718999999999998E-5,0.96414999999999995,3.5171000000000001,3.6478763677850958]
[39,117,719.98,5.9138000000000002E-5,0.96238000000000001,3.4670999999999998,3.6026309773686069]
[39,118,722.85,5.9548E-5,0.9607,3.42,3.5599042364942228]
[39,119,725.65,5.9948999999999998E-5,0.95911000000000002,3.3755000000000002,3.519408618406648]
[39,120,728.36,6.0340999999999997E-5,0.95760000000000001,3.3334999999999999,3.48109857978279]
[39,121,731,6.0726000000000001E-5,0.95616000000000001,3.2936999999999999,3.4447163654618471]
[39,122,733.58,6.1103000000000001E-5,0.95479000000000003,3.2559,3.4100692298830109]
[39,123,736.08,6.1472999999999999E-5,0.95348999999999995,3.22,3.3770674050068701]
[39,124,738.53,6.1835999999999995E-5,0.95223999999999998,3.1858,3.3455851466016973]
[39,125,740.91,6.2193000000000006E-5,0.95104999999999995,3.1532,3.3154934020293361]
[39,126,743.24,6.2543000000000001E-5,0.94991000000000003,3.1221000000000001,3.2867324272825846]
[39,127,745.52,6.2887999999999998E-5,0.94881000000000004,3.0924,3.2592405223385081]
[39,128,747.74,6.3227999999999998E-5,0.94776000000000005,3.0640000000000001,3.2328859626909767]
[39,129,749.92,6.3561999999999999E-5,0.94676000000000005,3.0367999999999999,3.2075710845409606]
[39,130,752.05,6.3891000000000002E-5,0.94579000000000002,3.0106999999999999,3.1832647839372377]
[39,131,754.14,6.4214999999999994E-5,0.94484999999999997,2.9855999999999998,3.1598666454992856]
[39,132,756.18,6.4534000000000002E-5,0.94396000000000002,2.9615,3.1373151404720541]
[39,133,758.19,6.4849000000000002E-5,0.94308999999999998,2.9382999999999999,3.1156093267874754]
[39,134,760.16,6.5160000000000006E-5,0.94225999999999999,2.9159999999999999,3.0946872413134381]
[39,135,762.09,6.5467000000000002E-5,0.94145000000000001,2.8944999999999999,3.0745127197408251]
[39,136,763.98,6.5769E-5,0.94067000000000001,2.8738000000000001,3.0550565022802898]
[39,137,765.84,6.6068000000000005E-5,0.93991999999999998,2.8536999999999999,3.0361094561239255]
[39,138,767.67,6.6363000000000001E-5,0.93918999999999997,2.8344,3.0179196967599742]
[39,139,769.47,6.6654000000000003E-5,0.93849000000000005,2.8157000000000001,3.0002450745346247]
[39,140,771.24,6.6941999999999997E-5,0.93781000000000003,2.7976000000000001,2.983120248237916]
[39,141,772.97,6.7226999999999999E-5,0.93715000000000004,2.7801,2.9665475110707997]
[39,142,774.68,6.7508000000000005E-5,0.93650999999999995,2.7631999999999999,2.9505290920545431]
[39,143,776.37,6.7787000000000007E-5,0.93589,2.7467000000000001,2.9348534550000536]
[39,144,778.02,6.8062E-5,0.93528999999999995,2.7307999999999999,2.919736124624448]
[39,145,779.65,6.8334E-5,0.93471000000000004,2.7153,2.9049651763648616]
[39,146,781.26,6.8603999999999996E-5,0.93413999999999997,2.7002999999999999,2.8906801978290191]
[39,147,782.84,6.8870999999999998E-5,0.93359000000000003,2.6857000000000002,{"$f":"F1091/E1091","v":2.8767446095180969}]
[39,148,784.4,6.9134999999999995E-5,0.93305000000000005,2.6715,2.863190611435614]
[39,149,785.94,6.9395999999999998E-5,0.93254000000000004,2.6577000000000002,2.8499581787376416]
[39,150,787.46,6.9654999999999996E-5,0.93203000000000003,2.6442999999999999,2.8371404353937102]
[39,151,788.95,6.9912000000000004E-5,0.93154000000000003,2.6313,2.8246774158919639]
[39,152,790.43,7.0166000000000005E-5,0.93106,2.6185999999999998,2.8124932872210167]
[39,153,791.88,7.0417E-5,0.93059999999999998,2.6061999999999999,2.8005587792821833]
[39,154,793.32,7.0667000000000006E-5,0.93013999999999997,2.5941000000000001,2.7889349990324037]
[39,155,794.73,7.0914000000000006E-5,0.92969999999999997,2.5823,2.77756265461977]
[39,156,796.13,7.1160000000000003E-5,0.92927999999999999,2.5708000000000002,2.766442837465565]
[39,157,797.51,7.1402999999999994E-5,0.92886000000000002,2.5596000000000001,2.7556359408306959]
[39,158,798.88,7.1643999999999994E-5,0.92845,2.5487000000000002,2.7451128224460124]
[39,159,800.23,7.1883000000000003E-5,0.92805000000000004,2.5379999999999998,2.7347664457733956]
[39,160,801.56,7.2119999999999994E-5,0.92766999999999999,2.5276000000000001,2.7246758006618732]
[39,161,802.87,7.2355999999999996E-5,0.92728999999999995,2.5173999999999999,2.7147925675894271]
[39,162,804.18,7.2589000000000006E-5,0.92691999999999997,2.5074000000000001,2.7050878177188973]
[39,163,805.46,7.2821E-5,0.92657,2.4977,2.6956409121814864]
[39,164,806.73,7.3051000000000002E-5,0.92622000000000004,2.4882,2.6864027984712053]
[39,165,807.99,7.3279000000000001E-5,0.92588000000000004,2.4788000000000001,2.6772367909448307]
[39,166,809.23,7.3505999999999997E-5,0.92554000000000003,2.4697,2.6683881841951727]
[39,167,810.46,7.3731000000000003E-5,0.92522000000000004,2.4607999999999999,2.6596917489894292]
[39,168,811.68,7.3954000000000004E-5,0.92490000000000006,2.452,2.6510974159368579]
[39,169,812.88,7.4176000000000003E-5,0.92459000000000002,2.4434999999999998,2.6427930217718121]
[39,170,814.07,7.4395999999999997E-5,0.92428999999999994,2.4350999999999998,2.6345627454586764]
[39,171,815.25,7.4615000000000003E-5,0.92400000000000004,2.4268999999999998,2.626515151515151]
[39,172,816.42,7.4832000000000005E-5,0.92371000000000003,2.4188000000000001,2.6185707635513311]
[39,173,817.57,7.5048000000000004E-5,0.92342999999999997,2.4108999999999998,2.6108096986236098]
[39,174,818.72,7.5261999999999999E-5,0.92315999999999998,2.4032,2.603232375752849]
[39,175,819.85,7.5475000000000005E-5,0.92288999999999999,2.3956,2.5957589745256748]
[39,176,820.97,7.5686999999999995E-5,0.92262999999999995,2.3881000000000001,2.5883615317082689]
[39,177,822.08,7.5897999999999997E-5,0.92237000000000002,2.3807999999999998,2.5811767511952901]
[39,178,823.18,7.6106999999999995E-5,0.92212000000000005,2.3736000000000002,2.5740684509608296]
[39,179,824.27,7.6315000000000004E-5,0.92188000000000003,2.3664999999999998,2.5670369245454938]
[39,180,825.35,7.6520999999999995E-5,0.92164000000000001,2.3595999999999999,2.5602187405060541]
[39,181,826.42,7.6726999999999999E-5,0.92140999999999995,2.3527999999999998,2.5534778220336225]
[39,182,827.48,7.6930999999999999E-5,0.92118,2.3460999999999999,2.5468420938361667]
[39,183,828.53,7.7133999999999997E-5,0.92096,2.3395999999999999,2.5403926337734535]
[39,184,829.57,7.7336000000000006E-5,0.92074,2.3331,2.5339400916653996]
[39,185,830.6,7.7537E-5,0.92052999999999996,2.3268,2.5276742746026746]
[39,186,831.62,7.7736000000000002E-5,0.92032000000000003,2.3205,2.5214055980528509]
[39,187,832.64,7.7935000000000005E-5,0.92012000000000005,2.3144,2.5153240881624135]
[39,188,833.64,7.8132000000000003E-5,0.91991999999999996,2.3083999999999998,2.5093486390120878]
[39,189,834.64,7.8329000000000002E-5,0.91971999999999998,2.3024,2.5033705910494497]
[39,190,835.63,7.8523999999999996E-5,0.91952999999999996,2.2966000000000002,2.4975802855806775]
[39,191,836.61,7.8719000000000003E-5,0.91935,2.2909000000000002,2.4918692554522219]
[39,192,837.58,7.8912000000000006E-5,0.91917000000000004,2.2852000000000001,2.4861559885548918]
[39,193,838.55,7.9104999999999996E-5,0.91898999999999997,2.2797000000000001,2.4806581137988446]
[39,194,839.5,7.9295999999999994E-5,0.91881999999999997,2.2742,2.4751311464704733]
[39,195,840.45,7.9487000000000007E-5,0.91864999999999997,2.2688000000000001,2.4697109889511788]
[39,196,841.39,7.9676000000000001E-5,0.91847999999999996,2.2635000000000001,2.4643977005487328]
[39,197,842.33,7.9864999999999995E-5,0.91832000000000003,2.2583000000000002,2.4591645613729423]
[39,198,843.26,8.0053000000000001E-5,0.91815999999999998,2.2530999999999999,2.4539295983270888]
[39,199,844.18,8.0239000000000002E-5,0.91800999999999999,2.2480000000000002,2.4487750678097191]
[39,200,845.09,8.0426000000000006E-5,0.91785000000000005,2.2431000000000001,2.4438633763686877]
[40,74,224.07,1.9904000000000001E-5,0.95828999999999998,3.1593,3.2968099427104529]
[40,75,231.53,2.0159000000000001E-5,0.96877999999999997,3.3553000000000002,3.4634282293193506]
[40,76,239.48,2.0440000000000001E-5,0.97992999999999997,3.5807000000000002,3.6540365128121399]
[40,77,247.99,2.075E-5,0.99182999999999999,3.8424999999999998,3.8741518203724428]
[40,78,257.14999999999998,2.1095999999999999E-5,1.0044999999999999,4.1494999999999997,4.1309109009457439]
[40,79,267.07,2.1484999999999998E-5,1.0182,4.5136000000000003,4.4329208406992739]
[40,80,277.89999999999998,2.1926999999999999E-5,1.0328999999999999,4.9500999999999999,4.792429083163908]
[40,81,289.82,2.2433999999999999E-5,1.0486,5.4794999999999998,5.2255388136563035]
[40,82,303.05,2.3023E-5,1.0657000000000001,6.1280999999999999,5.7503049638735098]
[40,83,317.89999999999998,2.3716000000000001E-5,1.0839000000000001,6.9278000000000004,6.3915490358889198]
[40,84,334.71,2.4545E-5,1.1033999999999999,7.9132999999999996,{"$f":"F1155/E1155","v":7.171741888707631}]
[40,85,353.91,2.5547000000000001E-5,1.1234999999999999,9.1149000000000004,8.112950600801069]
[40,86,375.95,2.6774000000000001E-5,1.1432,10.538,9.2179846046186142]
[40,87,401.13,2.828E-5,1.1597999999999999,12.074,10.410415588894637]
[40,88,429.1,3.0086E-5,1.1695,13.260999999999999,11.339033775117571]
[40,89,458.03,3.2107000000000003E-5,1.1693,13.432,11.487214572821346]
[40,90,485.5,3.4177999999999997E-5,1.1604000000000001,12.833,11.059117545673905]
[40,91,510.38,3.6183999999999998E-5,1.1458999999999999,11.840999999999999,10.333362422549961]
[40,92,532.04,3.8039E-5,1.1288,10.657999999999999,9.4418851878100636]
[40,93,550.54,3.9706000000000002E-5,1.1115999999999999,9.5358000000000001,8.5784454839870463]
[40,94,566.35,4.1192999999999997E-5,1.0952999999999999,8.5902999999999992,7.8428740984205234]
[40,95,580.01,4.2524999999999997E-5,1.0806,7.8277999999999999,7.2439385526559317]
[40,96,591.97,4.3730000000000003E-5,1.0676000000000001,7.2148000000000003,6.7579617834394901]
[40,97,602.58000000000004,4.4829000000000001E-5,1.0561,6.7156000000000002,6.358867531483761]
[40,98,612.11,4.5840999999999997E-5,1.046,6.3021000000000003,6.0249521988527723]
[40,99,620.73,4.6777999999999998E-5,1.0370999999999999,5.9541000000000004,5.7411050043390235]
[40,100,628.61,4.7651999999999997E-5,1.0290999999999999,5.6574999999999998,5.4975221066951709]
[40,101,635.86,4.8470999999999997E-5,1.0221,5.4015000000000004,5.2847079542119166]
[40,102,642.57000000000005,4.9243000000000003E-5,1.0157,5.1783999999999999,5.0983558137245248]
[40,103,648.82000000000005,4.9972999999999997E-5,1.01,4.9821999999999997,4.9328712871287124]
[40,104,654.66,5.0667000000000001E-5,1.0047999999999999,4.8083999999999998,4.7854299363057331]
[40,105,660.15,5.1328000000000001E-5,1.0001,4.6532999999999998,4.6528347165283472]
[40,106,665.33,5.1959999999999997E-5,0.99580999999999997,4.5140000000000002,4.5329932416826511]
[40,107,670.22,5.2565000000000002E-5,0.99187999999999998,4.3880999999999997,4.4240230673065284]
[40,108,674.87,5.3146999999999998E-5,0.98826999999999998,4.2739000000000003,4.3246278850921307]
[40,109,679.3,5.3708000000000001E-5,0.98492999999999997,4.1696999999999997,4.2334988273278302]
[40,110,683.52,5.4249000000000002E-5,0.98185,4.0742000000000003,4.1495136731679994]
[40,111,687.56,5.4771999999999997E-5,0.97899000000000003,3.9864000000000002,4.0719517053289618]
[40,112,691.43,5.5278000000000002E-5,0.97631999999999997,3.9054000000000002,4.0001229105211413]
[40,113,695.15,5.5769000000000001E-5,0.97384000000000004,3.8304,3.9332949971247841]
[40,114,698.73,5.6246000000000003E-5,0.97150999999999998,3.7606999999999999,3.8709843439594036]
[40,115,702.17,5.6709999999999997E-5,0.96933000000000002,3.6957,3.8126334684782273]
[40,116,705.5,5.7160999999999997E-5,0.96728000000000003,3.6351,3.7580638491439915]
[40,117,708.71,5.7602000000000002E-5,0.96533999999999998,3.5783,3.7067768868999527]
[40,118,711.82,5.8031000000000001E-5,0.96352000000000004,3.5249999999999999,3.6584606443042178]
[40,119,714.84,5.8451E-5,0.96179000000000003,3.4748999999999999,3.6129508520571014]
[40,120,717.76,5.8860999999999998E-5,0.96016000000000001,3.4276,3.569821696383936]
[40,121,720.6,5.9262000000000003E-5,0.95860999999999996,3.383,3.5290681298964128]
[40,122,723.36,5.9654999999999997E-5,0.95713000000000004,3.3408000000000002,3.4904349461410678]
[40,123,726.04,6.0041000000000003E-5,0.95572999999999997,3.3008000000000002,3.4536950812467961]
[40,124,728.65,6.0418000000000003E-5,0.95438999999999996,3.2627999999999999,3.4187281928771256]
[40,125,731.2,6.0788999999999997E-5,0.95311000000000001,3.2267000000000001,3.3854434430443496]
[40,126,733.68,6.1153000000000002E-5,0.95187999999999995,3.1924000000000001,3.3537840904315672]
[40,127,736.1,6.1509999999999999E-5,0.95071000000000006,3.1596000000000002,3.3234109244669772]
[40,128,738.47,6.1860999999999996E-5,0.94959000000000005,3.1282999999999999,3.2943691487905302]
[40,129,740.78,6.2206999999999996E-5,0.94850999999999996,3.0983999999999998,3.2665970838472971]
[40,130,743.04,6.2546999999999996E-5,0.94747999999999999,3.0697999999999999,3.2399628488200278]
[40,131,745.25,6.2880999999999996E-5,0.94647999999999999,3.0424000000000002,3.2144366494801795]
[40,132,747.41,6.3211000000000002E-5,0.94552000000000003,3.0160999999999998,3.1898849310432351]
[40,133,749.53,6.3534999999999994E-5,0.9446,2.9908999999999999,3.1663137836121109]
[40,134,751.61,6.3855000000000004E-5,0.94371000000000005,2.9666000000000001,3.1435504551186275]
[40,135,753.64,6.4171000000000006E-5,0.94284999999999997,2.9432999999999998,3.1217054674656626]
[40,136,755.64,6.4481999999999997E-5,0.94203000000000003,2.9207999999999998,3.1005381994204004]
[40,137,757.6,6.4789000000000006E-5,0.94123000000000001,2.8992,3.0802248122138054]
[40,138,759.52,6.5092000000000006E-5,0.94045000000000001,2.8782999999999999,3.0605561167526183]
[40,139,761.41,6.5390999999999998E-5,0.93971000000000005,2.8580999999999999,3.0414702408189758]
[40,140,763.27,6.5685999999999994E-5,0.93898000000000004,2.8386999999999998,3.023174082515069]
[40,141,765.09,6.5977999999999997E-5,0.93828,2.8197999999999999,3.0052862684912816]
[40,142,766.88,6.6266000000000006E-5,0.93761000000000005,2.8016000000000001,2.9880227386653297]
[40,143,768.65,6.6550999999999994E-5,0.93694999999999995,2.7839999999999998,2.9713431880036287]
[40,144,770.38,6.6833000000000002E-5,0.93630999999999998,2.7669000000000001,2.955111020922558]
[40,145,772.09,6.7112000000000004E-5,0.93569000000000002,2.7504,2.9394350693071423]
[40,146,773.76,6.7386999999999997E-5,0.93508999999999998,2.7343000000000002,2.9241035622239573]
[40,147,775.42,6.7659999999999999E-5,0.93450999999999995,2.7187999999999999,2.9093321633797391]
[40,148,777.05,6.7929999999999995E-5,0.93393999999999999,2.7037,{"$f":"F1219/E1219","v":2.8949397177548879}]
[40,149,778.65,6.8196999999999998E-5,0.93339000000000005,2.6890000000000001,2.8808965169971823]
[40,150,780.23,6.8460999999999994E-5,0.93286000000000002,2.6747000000000001,2.8672040820701929]
[40,151,781.79,6.8721999999999997E-5,0.93233999999999995,2.6608000000000001,2.8538945020057063]
[40,152,783.33,6.8981999999999998E-5,0.93183000000000005,2.6473,2.8409688462487792]
[40,153,784.84,6.9238000000000004E-5,0.93133999999999995,2.6341999999999999,2.8283977924281145]
[40,154,786.34,6.9492999999999993E-5,0.93086000000000002,2.6214,2.8161055368154178]
[40,155,787.81,6.9745000000000004E-5,0.9304,2.6089000000000002,2.804062768701634]
[40,156,789.27,6.9993999999999994E-5,0.92993999999999999,2.5968,2.7924382218207628]
[40,157,790.7,7.0241999999999996E-5,0.92949999999999999,2.5849000000000002,2.7809575040344274]
[40,158,792.12,7.0487000000000005E-5,0.92906999999999995,2.5733999999999999,2.7698666408343828]
[40,159,793.52,7.0730999999999998E-5,0.92864999999999998,2.5621,2.7589511656705974]
[40,160,794.9,7.0971999999999997E-5,0.92823999999999995,2.5510999999999999,2.7483194001551325]
[40,161,796.27,7.1211000000000006E-5,0.92784,2.5404,2.7379720641489911]
[40,162,797.62,7.1447999999999998E-5,0.92745999999999995,2.5299,2.7277726263127251]
[40,163,798.95,7.1684E-5,0.92708000000000002,2.5196000000000001,2.71778055831212]
[40,164,800.27,7.1916999999999996E-5,0.92671000000000003,2.5095999999999998,2.7080748022574479]
[40,165,801.57,7.2149000000000003E-5,0.92635000000000001,2.4998,2.6985480649862361]
[40,166,802.86,7.2379000000000006E-5,0.92600000000000005,2.4902000000000002,2.6892008639308855]
[40,167,804.13,7.2607000000000005E-5,0.92564999999999997,2.4807999999999999,2.6800626586722842]
[40,168,805.39,7.2834000000000001E-5,0.92532000000000003,2.4716999999999998,2.6711840228245363]
[40,169,806.64,7.3059000000000006E-5,0.92498999999999998,2.4626999999999999,2.662407161158499]
[40,170,807.87,7.3281999999999994E-5,0.92467999999999995,2.4539,2.6537829303110265]
[40,171,809.09,7.3504000000000006E-5,0.92435999999999996,2.4453,2.645397896923277]
[40,172,810.29,7.3724000000000001E-5,0.92405999999999999,2.4367999999999999,2.6370581996840032]
[40,173,811.48,7.3943000000000007E-5,0.92376000000000003,2.4285999999999999,2.6290378453277907]
[40,174,812.66,7.4160999999999997E-5,0.92347999999999997,2.4205000000000001,2.6210638021397323]
[40,175,813.83,7.4375999999999994E-5,0.92318999999999996,2.4125000000000001,2.6132215470271563]
[40,176,814.99,7.4591000000000005E-5,0.92291999999999996,2.4047000000000001,2.6055346075499504]
[40,177,816.14,7.4803999999999997E-5,0.92264999999999997,2.3971,2.5980599360537582]
[40,178,817.27,7.5016000000000001E-5,0.92237999999999998,2.3896000000000002,2.5906893037576708]
[40,179,818.39,7.5226000000000001E-5,0.92213000000000001,2.3822000000000001,2.5833667704119812]
[40,180,819.51,7.5434999999999999E-5,0.92188000000000003,2.375,2.576257213520198]
[40,181,820.61,7.5642999999999994E-5,0.92162999999999995,2.3679000000000001,2.5692523029849292]
[40,182,821.7,7.5848999999999998E-5,0.92139000000000004,2.3609,2.5623243143511432]
[40,183,822.78,7.6055000000000003E-5,0.92115000000000002,2.3540999999999999,2.5556098355316723]
[40,184,823.86,7.6259000000000003E-5,0.92093000000000003,2.3473999999999999,2.5489450881174465]
[40,185,824.92,7.6462000000000001E-5,0.92069999999999996,2.3408000000000002,2.5424133811230587]
[40,186,825.97,7.6663999999999996E-5,0.92047999999999996,2.3342999999999998,2.5359594993916215]
[40,187,827.01,7.6864000000000001E-5,0.92027000000000003,2.3279000000000001,2.5295837091288425]
[40,188,828.05,7.7064000000000006E-5,0.92005999999999999,2.3216000000000001,2.5233136969328087]
[40,189,829.07,7.7262000000000007E-5,0.91984999999999995,2.3155000000000001,2.5172582486274937]
[40,190,830.09,7.7459999999999994E-5,0.91964999999999997,2.3094000000000001,2.511172728755505]
[40,191,831.1,7.7656000000000003E-5,0.91946000000000006,2.3033999999999999,2.505166075740108]
[40,192,832.1,7.7850999999999997E-5,0.91927000000000003,2.2976000000000001,2.4993745036822697]
[40,193,833.09,7.8046000000000005E-5,0.91908000000000001,2.2917999999999998,2.4935805370587976]
[40,194,834.07,7.8238999999999994E-5,0.91890000000000005,2.2860999999999998,2.4878659266514309]
[40,195,835.05,7.8430999999999995E-5,0.91871999999999998,2.2805,2.4822579240682687]
[40,196,836.02,7.8622999999999996E-5,0.91854000000000002,2.2749999999999999,2.4767565919829293]
[40,197,836.98,7.8813000000000006E-5,0.91837000000000002,2.2696000000000001,2.4713350828097607]
[40,198,837.93,7.9002E-5,0.91820999999999997,2.2643,2.4659936180176647]
[40,199,838.87,7.9190999999999994E-5,0.91803999999999997,2.2589999999999999,2.4606770946799705]
[40,200,839.81,7.9379E-5,0.91788000000000003,2.2538999999999998,2.4555497450647139]
[41,74,219.26,1.9799000000000001E-5,0.94650000000000001,2.9723000000000002,3.1403063919704173]
[41,75,226.22,2.0032000000000001E-5,0.95589000000000002,3.1362000000000001,3.280921444936133]
[41,76,233.58,2.0285999999999999E-5,0.96577999999999997,3.3220000000000001,3.4397067655159561]
[41,77,241.4,2.0564000000000002E-5,0.97623000000000004,3.5339999999999998,3.6200485541317104]
[41,78,249.74,2.0871000000000001E-5,0.98729999999999996,3.7778,3.8263952192849189]
[41,79,258.68,2.1211000000000001E-5,0.99902999999999997,4.0603999999999996,4.0643424121397755]
[41,80,268.31,2.1590000000000002E-5,1.0115000000000001,4.3906999999999998,4.3407810182896682]
[41,81,278.75,2.2018000000000002E-5,1.0246999999999999,4.7803000000000004,4.6650727042061098]
[41,82,290.14999999999998,2.2503000000000001E-5,1.0387999999999999,5.2431000000000001,5.0472660762418178]
[41,83,302.68,2.3061000000000002E-5,1.0537000000000001,5.7964000000000002,5.5009964885641072]
[41,84,316.55,2.3706E-5,1.0693999999999999,6.4593999999999996,6.0402094632504211]
[41,85,332.01,2.4462999999999999E-5,1.0858000000000001,7.2508999999999997,{"$f":"F1283/E1283","v":6.6779333210536}]
[41,86,349.34,2.5357000000000001E-5,1.1026,8.1839999999999993,7.4224560130600388]
[41,87,368.81,2.6421999999999999E-5,1.1189,9.2567000000000004,8.2730360175172049]
[41,88,390.63,2.7691999999999998E-5,1.1334,10.419,9.1926945473795669]
[41,89,414.69,2.919E-5,1.1437999999999999,11.48,10.036719706242351]
[41,90,440.2,3.0893999999999999E-5,1.1478999999999999,12.063000000000001,10.508755118041643]
[41,91,465.57,3.2710999999999999E-5,1.1451,11.932,10.420050650598201]
[41,92,489.47,3.4539000000000003E-5,1.1367,11.436999999999999,10.061581771795547]
[41,93,511.28,3.6309000000000001E-5,1.1246,10.677,9.494042326160411]
[41,94,530.63,3.7963999999999998E-5,1.1107,9.7965999999999998,8.8202034752858562]
[41,95,547.57000000000005,3.9480000000000001E-5,1.0965,8.9375999999999998,8.151025991792066]
[41,96,562.35,4.0858000000000001E-5,1.0829,8.1784999999999997,7.5524055776156613]
[41,97,575.35,4.2110999999999997E-5,1.0703,7.5384000000000002,7.0432588993740071]
[41,98,586.88,4.3257999999999998E-5,1.0589999999999999,7.0060000000000002,6.615675165250237]
[41,99,597.21,4.4313000000000001E-5,1.0488,6.5617000000000001,6.2563882532418003]
[41,100,606.54999999999995,4.5291999999999999E-5,1.0397000000000001,6.1871,5.9508512070789648]
[41,101,615.05999999999995,4.6202999999999998E-5,1.0316000000000001,5.8677000000000001,5.6879604497867389]
[41,102,622.88,4.7057E-5,1.0244,5.5921000000000003,5.4589027723545493]
[41,103,630.1,4.7861000000000001E-5,1.0179,5.3521000000000001,5.2579821200510857]
[41,104,636.79999999999995,4.8621000000000001E-5,1.0121,5.1412000000000004,5.0797352040312225]
[41,105,643.05999999999995,4.9342000000000003E-5,1.0067999999999999,4.9543999999999997,4.9209376241557408]
[41,106,648.92999999999995,5.0028000000000003E-5,1.002,4.7877999999999998,4.7782435129740515]
[41,107,654.45000000000005,5.0683000000000002E-5,0.99756,4.6383999999999999,4.649745378724087]
[41,108,659.67,5.1310000000000002E-5,0.99353999999999998,4.5034999999999998,4.5327817702357223]
[41,109,664.61,5.1912E-5,0.98985000000000001,4.3811,4.4260241450724855]
[41,110,669.31,5.2491000000000003E-5,0.98643999999999998,4.2697000000000003,4.3283930092048175]
[41,111,673.78,5.3050000000000002E-5,0.98329,4.1676000000000002,4.2384240661452877]
[41,112,678.05,5.3588999999999998E-5,0.98036999999999996,4.0739000000000001,4.1554719136652487]
[41,113,682.14,5.4110000000000002E-5,0.97765000000000002,3.9874999999999998,4.0786580064440239]
[41,114,686.06,5.4614999999999998E-5,0.97511000000000003,3.9075000000000002,4.0072402087969561]
[41,115,689.83,5.5105999999999997E-5,0.97272999999999998,3.8332999999999999,3.940764652061723]
[41,116,693.45,5.5581999999999997E-5,0.97050000000000003,3.7642000000000002,3.8786192684183414]
[41,117,696.94,5.6045999999999998E-5,0.96840999999999999,3.6998000000000002,3.8204892555838956]
[41,118,700.32,5.6496999999999998E-5,0.96643000000000001,3.6395,3.7659220015934936]
[41,119,703.58,5.6937000000000001E-5,0.96457000000000004,3.5830000000000002,3.7146085820624735]
[41,120,706.73,5.7367000000000001E-5,0.96281000000000005,3.5299,3.6662477539701497]
[41,121,709.79,5.7785999999999999E-5,0.96113999999999999,3.4798,3.6204923320223901]
[41,122,712.75,5.8196999999999999E-5,0.95955000000000001,3.4327000000000001,3.5774060757646815]
[41,123,715.63,5.8597999999999997E-5,0.95804,3.3881000000000001,3.5364911694710033]
[41,124,718.43,5.8990999999999998E-5,0.95660999999999996,3.3458999999999999,3.4976636246746322]
[41,125,721.15,5.9376999999999997E-5,0.95523999999999998,3.3058000000000001,3.4607009756710356]
[41,126,723.8,5.9755E-5,0.95392999999999994,3.2677999999999998,3.4256182319457404]
[41,127,726.38,6.0124999999999998E-5,0.95267999999999997,3.2315999999999998,3.3921148759289581]
[41,128,728.9,6.0489999999999999E-5,0.95147999999999999,3.1972,3.3602387858914535]
[41,129,731.36,6.0847000000000002E-5,0.95033000000000001,3.1642999999999999,3.3296854776761755]
[41,130,733.76,6.1198999999999995E-5,0.94923000000000002,3.133,3.3005699356320384]
[41,131,736.1,6.1544999999999994E-5,0.94816999999999996,3.1030000000000002,3.2726198888384999]
[41,132,738.39,6.1884999999999994E-5,0.94715000000000005,3.0743,3.2458427915324921]
[41,133,740.63,6.2219999999999997E-5,0.94616999999999996,3.0467,3.220034454696302]
[41,134,742.83,6.2549E-5,0.94523000000000001,3.0203000000000002,3.1953069623266295]
[41,135,744.98,6.2873999999999995E-5,0.94430999999999998,2.9950000000000001,3.1716279611568239]
[41,136,747.09,6.3194000000000005E-5,0.94343999999999995,2.9706000000000001,3.1486899007886038]
[41,137,749.15,6.3509999999999993E-5,0.94259000000000004,2.9472,3.1267040813078855]
[41,138,751.17,6.3820999999999998E-5,0.94177,2.9245999999999999,3.105429138749376]
[41,139,753.16,6.4128999999999995E-5,0.94098000000000004,2.9028,3.0848689663967352]
[41,140,755.11,6.4431999999999996E-5,0.94020999999999999,2.8818999999999999,3.0651662926367513]
[41,141,757.03,6.4731000000000001E-5,0.93947000000000003,2.8616000000000001,3.0459727293048209]
[41,142,758.91,6.5026999999999999E-5,0.93874999999999997,2.8420000000000001,3.027430093209055]
[41,143,760.75,6.5319000000000003E-5,0.93805000000000005,2.8231000000000002,3.0095410692393796]
[41,144,762.57,6.5606999999999997E-5,0.93737999999999999,2.8048000000000002,2.9921696643837081]
[41,145,764.36,6.5891999999999999E-5,0.93672,2.7871000000000001,2.9753821846442907]
[41,146,766.12,6.6173999999999994E-5,0.93608999999999998,2.7698999999999998,2.9590103515687591]
[41,147,767.84,6.6452999999999995E-5,0.93547000000000002,2.7532999999999999,2.9432263995638555]
[41,148,769.55,6.6729000000000004E-5,0.93486999999999998,2.7372000000000001,2.9278937178431228]
[41,149,771.22,6.7001000000000004E-5,0.93428999999999995,2.7214999999999998,{"$f":"F1347/E1347","v":2.9129071273373364}]
[41,150,772.87,6.7271E-5,0.93371999999999999,2.7063000000000001,2.8984063745019921]
[41,151,774.5,6.7538000000000003E-5,0.93317000000000005,2.6916000000000002,2.8843619061907262]
[41,152,776.1,6.7803000000000001E-5,0.93264000000000002,2.6772,2.8705609881626351]
[41,153,777.68,6.8065000000000006E-5,0.93211999999999995,2.6633,2.8572501394670216]
[41,154,779.24,6.8324000000000005E-5,0.93161000000000005,2.6497000000000002,2.8442159272657013]
[41,155,780.77,6.8580999999999999E-5,0.93111999999999995,2.6364999999999998,2.8315362144514133]
[41,156,782.29,6.8835000000000001E-5,0.93064000000000002,2.6236999999999999,2.8192426717097909]
[41,157,783.78,6.9086999999999998E-5,0.93017000000000005,2.6111,2.8071212789060063]
[41,158,785.25,6.9337000000000004E-5,0.92971999999999999,2.5989,2.7953577421159057]
[41,159,786.71,6.9585000000000005E-5,0.92927999999999999,2.5870000000000002,2.7838756887052343]
[41,160,788.14,6.9830000000000001E-5,0.92884,2.5754000000000001,2.7727057404935191]
[41,161,789.56,7.0073000000000005E-5,0.92842000000000002,2.5640999999999998,2.7617888455655843]
[41,162,790.96,7.0314999999999993E-5,0.92801,2.5529999999999999,2.7510479412937361]
[41,163,792.34,7.0554000000000002E-5,0.92761000000000005,2.5421999999999998,2.7405914123392372]
[41,164,793.71,7.0790999999999994E-5,0.92722000000000004,2.5316999999999998,2.7304199650568362]
[41,165,795.06,7.1026999999999996E-5,0.92684,2.5213999999999999,2.7204263950627938]
[41,166,796.39,7.1260000000000006E-5,0.92647000000000002,2.5112999999999999,2.7106112448325361]
[41,167,797.71,7.1491999999999999E-5,0.92610999999999999,2.5013999999999998,2.7009750461608233]
[41,168,799.01,7.1722000000000002E-5,0.92576000000000003,2.4918,2.6916263394400275]
[41,169,800.3,7.1950000000000001E-5,0.92540999999999995,2.4824000000000002,2.6824866815789763]
[41,170,801.58,7.2176999999999997E-5,0.92508000000000001,2.4731999999999998,2.6734985082371252]
[41,171,802.84,7.2402000000000002E-5,0.92474999999999996,2.4641000000000002,2.6646120573127874]
[41,172,804.08,7.2625000000000003E-5,0.92442999999999997,2.4552999999999998,2.6560150579275876]
[41,173,805.32,7.2847000000000002E-5,0.92412000000000005,2.4466999999999999,2.6475998788036184]
[41,174,806.54,7.3066999999999997E-5,0.92381000000000002,2.4382000000000001,2.6392872993364436]
[41,175,807.74,7.3286000000000003E-5,0.92351000000000005,2.4298999999999999,2.6311572154064384]
[41,176,808.94,7.3503000000000004E-5,0.92322000000000004,2.4217,2.623101752561686]
[41,177,810.12,7.3719000000000003E-5,0.92293999999999998,2.4137,2.6152295923895377]
[41,178,811.29,7.3932999999999998E-5,0.92266000000000004,2.4058999999999999,2.6075694188541823]
[41,179,812.45,7.4146000000000005E-5,0.92239000000000004,2.3982000000000001,2.5999848220384001]
[41,180,813.6,7.4357999999999995E-5,0.92212000000000005,2.3906999999999998,2.5926126751398946]
[41,181,814.73,7.4567999999999995E-5,0.92186000000000001,2.3833000000000002,2.5853166424402838]
[41,182,815.86,7.4777000000000006E-5,0.92161000000000004,2.3759999999999999,2.5780970258569242]
[41,183,816.97,7.4985000000000001E-5,0.92135999999999996,2.3689,2.5710905617782411]
[41,184,818.08,7.5191000000000006E-5,0.92112000000000005,2.3618999999999999,2.5641610213652943]
[41,185,819.17,7.5396999999999997E-5,0.92088000000000003,2.355,2.5573364607766482]
[41,186,820.26,7.5600999999999997E-5,0.92064999999999997,2.3483000000000001,2.550697876500299]
[41,187,821.33,7.5803000000000006E-5,0.92042999999999997,2.3416999999999999,2.5441369794552546]
[41,188,822.4,7.6005000000000002E-5,0.92020999999999997,2.3351000000000002,2.5375729453059632]
[41,189,823.45,7.6205999999999995E-5,0.91998999999999997,2.3287,2.5312231654691901]
[41,190,824.5,7.6404999999999998E-5,0.91978000000000004,2.3224,2.5249516188653809]
[41,191,825.54,7.6602999999999998E-5,0.91957,2.3161999999999998,2.5187859543047293]
[41,192,826.56,7.6800999999999999E-5,0.91937000000000002,2.3102,2.512807683522412]
[41,193,827.58,7.6996999999999995E-5,0.91918,2.3041999999999998,2.5067995387192932]
[41,194,828.59,7.7192000000000002E-5,0.91898000000000002,2.2982999999999998,2.5009249385187924]
[41,195,829.6,7.7385999999999994E-5,0.91879,2.2925,2.4951294637512382]
[41,196,830.59,7.7578999999999997E-5,0.91861000000000004,2.2867999999999999,2.4894133527830089]
[41,197,831.58,7.7770999999999998E-5,0.91842999999999997,2.2812000000000001,2.4838038827128908]
[41,198,832.55,7.7961999999999997E-5,0.91825000000000001,2.2755999999999998,2.4781922134494963]
[41,199,833.52,7.8152999999999995E-5,0.91808000000000001,2.2702,2.4727692575810387]
[41,200,834.49,7.8342000000000003E-5,0.91791,2.2648000000000001,2.4673442930134764]
[42,74,214.88,1.9711000000000002E-5,0.93610000000000004,2.8155999999999999,3.007798312146138]
[42,75,221.42,1.9925999999999999E-5,0.94459000000000004,2.9554,3.1287648609449601]
[42,76,228.3,2.0157999999999999E-5,0.95348999999999995,3.1118000000000001,3.2635895499690615]
[42,77,235.55,2.0409999999999999E-5,0.96282000000000001,3.2877999999999998,3.4147608067967012]
[42,78,243.24,2.0686000000000002E-5,0.97262999999999999,3.4870999999999999,3.5852276816466691]
[42,79,251.41,2.0988E-5,0.98292999999999997,3.7141000000000002,3.7786007141912448]
[42,80,260.13,2.1322E-5,0.99377000000000004,3.9744000000000002,3.99931573704177]
[42,81,269.49,2.1693000000000001E-5,1.0052000000000001,4.2747999999999999,4.2526860326303222]
[42,82,279.57,2.2107E-5,1.0172000000000001,4.6237000000000004,4.5455171057805739]
[42,83,290.49,2.2572999999999999E-5,1.0298,5.0309999999999997,4.8854146436201198]
[42,84,302.38,2.3102E-5,1.0428999999999999,5.5077999999999996,5.2812350177389966]
[42,85,315.42,2.3706999999999999E-5,1.0566,6.0659000000000001,5.7409615748627676]
[42,86,329.76,2.4403999999999999E-5,1.0707,6.7153,{"$f":"F1411/E1411","v":6.2718782105164843}]
[42,87,345.6,2.5213000000000001E-5,1.0848,7.4611999999999998,6.877949852507375]
[42,88,363.11,2.6157E-5,1.0985,8.2987000000000002,7.5545744196631768]
[42,89,382.42,2.7257E-5,1.1108,9.1990999999999996,8.2815088224702915]
[42,90,403.5,2.8532999999999999E-5,1.1206,10.074,8.9898268784579685]
[42,91,425.98,2.9981E-5,1.1262000000000001,10.733000000000001,9.5302788137098204]
[42,92,448.99,3.1560999999999998E-5,1.127,10.96,9.7249334516415278]
[42,93,471.4,3.3197000000000001E-5,1.123,10.749000000000001,9.5716829919857531]
[42,94,492.5,3.4827999999999999E-5,1.1152,10.332000000000001,9.264705882352942]
[42,95,511.9,3.6409000000000003E-5,1.105,9.7393999999999998,8.8139366515837096]
[42,96,529.37,3.7901999999999997E-5,1.0935999999999999,9.0670000000000002,8.290965618141918]
[42,97,544.95000000000005,3.9289000000000003E-5,1.0819000000000001,8.3985000000000003,7.7627322303355202]
[42,98,558.79,4.0568000000000002E-5,1.0706,7.7862999999999998,7.2728376611246031]
[42,99,571.14,4.1746999999999999E-5,1.0599000000000001,7.2504,6.8406453439003672]
[42,100,582.23,4.2837000000000003E-5,1.0502,6.7906000000000004,6.4660064749571511]
[42,101,592.25,4.3847999999999998E-5,1.0412999999999999,6.3975,6.1437626044367626]
[42,102,601.38,4.4792000000000001E-5,1.0333000000000001,6.0602,5.864898867705409]
[42,103,609.75,4.5676000000000001E-5,1.026,5.7683999999999997,5.6222222222222218]
[42,104,617.47,4.6508999999999998E-5,1.0195000000000001,5.5140000000000002,5.4085335948994606]
[42,105,624.64,4.7295E-5,1.0136000000000001,5.2904,5.2194159431728488]
[42,106,631.30999999999995,4.8041000000000003E-5,1.0083,5.0922000000000001,5.0502826539720322]
[42,107,637.55999999999995,4.8749999999999999E-5,1.0034000000000001,4.9156000000000004,4.8989435917879209]
[42,108,643.42999999999995,4.9427E-5,0.99895999999999996,4.7571000000000003,4.7620525346360223]
[42,109,648.97,5.0074999999999997E-5,0.99489000000000005,4.6140999999999996,4.6377991536752798]
[42,110,654.21,5.0695999999999997E-5,0.99116000000000004,4.4843999999999999,4.5243956576133018]
[42,111,659.18,5.1292000000000003E-5,0.98770999999999998,4.3662999999999998,4.4206295370098507]
[42,112,663.91,5.1867000000000003E-5,0.98451,4.2582000000000004,4.3251973062741875]
[42,113,668.42,5.2422000000000001E-5,0.98155000000000003,4.1589999999999998,4.2371758952676881]
[42,114,672.73,5.2957999999999997E-5,0.97879000000000005,4.0674999999999999,4.1556411487653122]
[42,115,676.86,5.3477000000000003E-5,0.97621999999999998,3.9828999999999999,4.0799205097211697]
[42,116,680.82,5.3980999999999997E-5,0.97380999999999995,3.9045000000000001,4.0095090418048702]
[42,117,684.63,5.4469000000000003E-5,0.97155000000000002,3.8315000000000001,3.9436982141938142]
[42,118,688.29,5.4944000000000001E-5,0.96943000000000001,3.7635000000000001,3.8821781871821588]
[42,119,691.83,5.5407E-5,0.96741999999999995,3.6999,3.8245022844266194]
[42,120,695.24,5.5856999999999997E-5,0.96553,3.6402999999999999,3.770260892981057]
[42,121,698.54,5.6297E-5,0.96374000000000004,3.5842999999999998,3.7191566190051257]
[42,122,701.73,5.6725999999999999E-5,0.96204000000000001,3.5316000000000001,3.6709492328801296]
[42,123,704.83,5.7145000000000003E-5,0.96043000000000001,3.4820000000000002,3.6254594296304781]
[42,124,707.83,5.7555E-5,0.95889999999999997,3.4350999999999998,3.582333924288247]
[42,125,710.75,5.7955999999999999E-5,0.95743999999999996,3.3906999999999998,3.5414229612299466]
[42,126,713.58,5.8349E-5,0.95604,3.3485999999999998,3.5025731140956444]
[42,127,716.34,5.8733999999999997E-5,0.95470999999999995,3.3087,3.4656597291324069]
[42,128,719.02,5.9111999999999999E-5,0.95343999999999995,3.2707999999999999,3.430525255915422]
[42,129,721.64,5.9483E-5,0.95221999999999996,3.2347000000000001,3.3970090945369771]
[42,130,724.19,5.9846999999999998E-5,0.95104,3.2002999999999999,3.3650529946164198]
[42,131,726.68,6.0204000000000002E-5,0.94991999999999999,3.1674000000000002,3.3343860535624055]
[42,132,729.11,6.0556000000000001E-5,0.94884000000000002,3.1360999999999999,3.3051937102145774]
[42,133,731.49,6.0902000000000001E-5,0.94779999999999998,3.1059999999999999,3.2770626714496727]
[42,134,733.81,6.1241999999999994E-5,0.94679999999999997,3.0773000000000001,3.2502112378538235]
[42,135,736.08,6.1576999999999997E-5,0.94582999999999995,3.0497000000000001,3.2243637863040928]
[42,136,738.31,6.1907000000000002E-5,0.94489999999999996,3.0232999999999999,3.1995978410413799]
[42,137,740.48,6.2230999999999994E-5,0.94401000000000002,2.9979,3.1757078844503766]
[42,138,742.62,6.2551999999999993E-5,0.94313999999999998,2.9735,3.1527662913247241]
[42,139,744.71,6.2867000000000006E-5,0.94230000000000003,2.95,3.1306378011249074]
[42,140,746.76,6.3178999999999999E-5,0.94149000000000005,2.9272999999999998,3.1092204909239607]
[42,141,748.77,6.3485999999999995E-5,0.94069999999999998,2.9055,3.0886573828000428]
[42,142,750.75,6.3788999999999995E-5,0.93994,2.8845000000000001,3.0688129029512523]
[42,143,752.69,6.4089000000000003E-5,0.93920999999999999,2.8641999999999999,3.0495842250401934]
[42,144,754.59,6.4383999999999999E-5,0.93849000000000005,2.8445,3.0309326684354652]
[42,145,756.47,6.4676000000000002E-5,0.93779999999999997,2.8256000000000001,3.013009170398806]
[42,146,758.31,6.4964999999999999E-5,0.93713000000000002,2.8071999999999999,2.9955289020733513]
[42,147,760.12,6.525E-5,0.93647999999999998,2.7894000000000001,2.9786007175807279]
[42,148,761.9,6.5531999999999995E-5,0.93584000000000001,2.7722000000000002,2.9622585057274748]
[42,149,763.65,6.5810999999999997E-5,0.93523000000000001,2.7555000000000001,2.9463340568630176]
[42,150,765.37,6.6087000000000006E-5,0.93462999999999996,2.7393000000000001,{"$f":"F1475/E1475","v":2.9308924387190656}]
[42,151,767.07,6.6359000000000006E-5,0.93405000000000005,2.7235999999999998,2.9159038595364271]
[42,152,768.74,6.6629000000000002E-5,0.93349000000000004,2.7084000000000001,2.9013701271572274]
[42,153,770.39,6.6896000000000005E-5,0.93293999999999999,2.6934999999999998,2.8871095676034897]
[42,154,772.01,6.7161000000000003E-5,0.93240000000000001,2.6791,2.8733376233376235]
[42,155,773.61,6.7422999999999995E-5,0.93188000000000004,2.6650999999999998,2.859917585955273]
[42,156,775.18,6.7681999999999993E-5,0.93137999999999999,2.6515,2.8468509094032513]
[42,157,776.74,6.7939000000000001E-5,0.93088000000000004,2.6383000000000001,2.8341998968717772]
[42,158,778.27,6.8193000000000003E-5,0.9304,2.6253000000000002,2.8216895958727433]
[42,159,779.78,6.8444999999999999E-5,0.92993999999999999,2.6128,2.8096436329225543]
[42,160,781.27,6.8695000000000006E-5,0.92947999999999997,2.6004999999999998,2.7978009209450443]
[42,161,782.74,6.8942000000000005E-5,0.92903999999999998,2.5886,2.7863170584689572]
[42,162,784.2,6.9188000000000002E-5,0.92859999999999998,2.5769000000000002,2.7750376911479648]
[42,163,785.63,6.9431000000000007E-5,0.92818000000000001,2.5655000000000001,2.7640112909134005]
[42,164,787.05,6.9672000000000006E-5,0.92776999999999998,2.5543999999999998,2.7532685902756069]
[42,165,788.45,6.9911000000000002E-5,0.92737000000000003,2.5436000000000001,2.7428103130357893]
[42,166,789.83,7.0148999999999995E-5,0.92698000000000003,2.5329999999999999,2.7325292886577919]
[42,167,791.2,7.0383999999999996E-5,0.92659999999999998,2.5226999999999999,2.7225339952514571]
[42,168,792.55,7.0617999999999994E-5,0.92622000000000004,2.5125000000000002,2.7126384660231913]
[42,169,793.88,7.0848999999999999E-5,0.92586000000000002,2.5026999999999999,2.7031084613224459]
[42,170,795.2,7.1079000000000002E-5,0.92551000000000005,2.4929999999999999,2.693649987574418]
[42,171,796.5,7.1308000000000002E-5,0.92515999999999998,2.4834999999999998,2.6844005361234813]
[42,172,797.79,7.1533999999999996E-5,0.92481999999999998,2.4742999999999999,2.675439544992539]
[42,173,799.07,7.1759000000000002E-5,0.92449000000000003,2.4651999999999998,2.6665512877370223]
[42,174,800.33,7.1982000000000003E-5,0.92417000000000005,2.4563000000000001,2.6578443359987882]
[42,175,801.57,7.2204000000000002E-5,0.92384999999999995,2.4476,2.6493478378524653]
[42,176,802.81,7.2423999999999996E-5,0.92354999999999998,2.4390999999999998,2.6410048183639216]
[42,177,804.03,7.2642E-5,0.92325000000000002,2.4308000000000001,2.632873002978608]
[42,178,805.24,7.2860000000000004E-5,0.92295000000000005,2.4226000000000001,2.6248442494176283]
[42,179,806.43,7.3075000000000001E-5,0.92266999999999999,2.4146000000000001,2.6169703144136043]
[42,180,807.62,7.3289999999999998E-5,0.92239000000000004,2.4066999999999998,2.6092000130096813]
[42,181,808.79,7.3502000000000002E-5,0.92210999999999999,2.399,2.6016418865428204]
[42,182,809.95,7.3714000000000006E-5,0.92184999999999995,2.3915000000000002,2.5942398437923742]
[42,183,811.1,7.3924000000000006E-5,0.92159000000000002,2.3839999999999999,2.5868336244967933]
[42,184,812.24,7.4133000000000003E-5,0.92132999999999998,2.3767999999999998,2.5797488413489194]
[42,185,813.36,7.4339999999999996E-5,0.92108000000000001,2.3696000000000002,2.572632127502497]
[42,186,814.48,7.4547000000000003E-5,0.92083999999999999,2.3626,2.5657008818035707]
[42,187,815.59,7.4752000000000005E-5,0.92059999999999997,2.3557000000000001,2.5588746469693682]
[42,188,816.68,7.4956000000000005E-5,0.92037000000000002,2.3489,2.5521257755033302]
[42,189,817.77,7.5158000000000001E-5,0.92013999999999996,2.3422000000000001,2.5454822092290303]
[42,190,818.85,7.5359999999999997E-5,0.91991999999999996,2.3357000000000001,2.5390251326202282]
[42,191,819.91,7.5560000000000002E-5,0.91969999999999996,2.3292999999999999,2.5326736979449822]
[42,192,820.97,7.5759000000000004E-5,0.91949000000000003,2.323,2.5264005046275653]
[42,193,822.02,7.5957999999999993E-5,0.91927999999999999,2.3167,2.5201244452179967]
[42,194,823.06,7.6155000000000005E-5,0.91908000000000001,2.3106,2.5140357749053401]
[42,195,824.09,7.6351000000000001E-5,0.91888000000000003,2.3046000000000002,2.5080532822566606]
[42,196,825.11,7.6545999999999995E-5,0.91868000000000005,2.2987000000000002,2.502177036617756]
[42,197,826.12,7.6738999999999998E-5,0.91849000000000003,2.2928999999999999,2.4963799279251813]
[42,198,827.13,7.6932000000000001E-5,0.91830999999999996,2.2871999999999999,2.4906621946837126]
[42,199,828.12,7.7124000000000002E-5,0.91813,2.2814999999999999,2.4849422195113982]
[42,200,829.11,7.7315000000000001E-5,0.91795000000000004,2.2759999999999998,2.4794378778800583]
[43,74,210.86,1.9636999999999999E-5,0.92683000000000004,2.6823000000000001,2.8940582415329672]
[43,75,217.04,1.9836000000000001E-5,0.93459000000000003,2.8031999999999999,2.9993901068917919]
[43,76,223.51,2.0049999999999999E-5,0.94267000000000001,2.9371,3.1157244847083283]
[43,77,230.3,2.0282E-5,0.95111000000000001,3.0861999999999998,3.2448402392993447]
[43,78,237.46,2.0533000000000001E-5,0.95992,3.2528000000000001,3.3886157179764984]
[43,79,245.01,2.0805000000000002E-5,0.96911999999999998,3.44,3.5496120191513949]
[43,80,253.01,2.1104E-5,0.97874000000000005,3.6514000000000002,3.7307150009195498]
[43,81,261.52999999999997,2.1430999999999999E-5,0.98877999999999999,3.8915000000000002,3.9356580836991042]
[43,82,270.61,2.1793E-5,0.99926999999999999,4.1653000000000002,4.1683428903099262]
[43,83,280.35000000000002,2.2194000000000001E-5,1.0102,4.4790000000000001,4.4337754900019801]
[43,84,290.83,2.2642000000000001E-5,1.0215000000000001,4.8395000000000001,4.7376407244248648]
[43,85,302.16000000000003,2.3146000000000002E-5,1.0331999999999999,5.2541000000000002,5.0852690669763847]
[43,86,314.45999999999998,2.3716000000000001E-5,1.0452999999999999,5.7298999999999998,5.4815842341911418]
[43,87,327.85,2.4363999999999999E-5,1.0575000000000001,6.2721,{"$f":"F1539/E1539","v":5.9310638297872336}]
[43,88,342.47,2.5103999999999999E-5,1.0696000000000001,6.8819999999999997,6.4341810022438288]
[43,89,358.42,2.5953E-5,1.0811999999999999,7.5541,6.9867739548649652]
[43,90,375.79,2.6925000000000001E-5,1.0918000000000001,8.2696000000000005,7.574281003846858]
[43,91,394.57,2.8036000000000001E-5,1.1005,8.9814000000000007,8.1611994547932767]
[43,92,414.57,2.9286999999999999E-5,1.1064000000000001,9.5919000000000008,8.669468546637745]
[43,93,435.3,3.0660000000000001E-5,1.1089,9.9639000000000006,8.9853909279466144]
[43,94,456.02,3.2115E-5,1.1075999999999999,10.006,9.0339472733838946]
[43,95,476.01,3.3596000000000002E-5,1.1031,9.7913999999999994,8.8762578188740822]
[43,96,494.86,3.5065999999999999E-5,1.0961000000000001,9.4369999999999994,8.6096159109570287]
[43,97,512.32000000000005,3.6492999999999998E-5,1.0874999999999999,8.9674999999999994,8.2459770114942526]
[43,98,528.23,3.7849999999999998E-5,1.0780000000000001,8.4425000000000008,7.8316326530612246]
[43,99,542.63,3.9125999999999998E-5,1.0684,7.9138999999999999,7.4072444777236992]
[43,100,555.61,4.0317E-5,1.0589999999999999,7.4169,7.0036827195467426]
[43,101,567.34,4.1425999999999999E-5,1.05,6.9686000000000003,6.6367619047619044]
[43,102,577.98,4.2460999999999999E-5,1.0416000000000001,6.5730000000000004,6.310483870967742]
[43,103,587.67999999999995,4.3429E-5,1.034,6.2271000000000001,6.0223404255319144]
[43,104,596.58000000000004,4.4338000000000001E-5,1.0268999999999999,5.9249000000000001,5.7696951991430527]
[43,105,604.79,4.5194000000000001E-5,1.0205,5.6597999999999997,5.5461048505634496]
[43,106,612.39,4.6003E-5,1.0146999999999999,5.4260999999999999,5.3474918695180849]
[43,107,619.48,4.6771000000000003E-5,1.0093000000000001,5.2187000000000001,5.1706132963440004]
[43,108,626.1,4.7500999999999998E-5,1.0044999999999999,5.0335999999999999,5.0110502737680438]
[43,109,632.32000000000005,4.8196999999999999E-5,1,4.8674999999999997,4.8674999999999997]
[43,110,638.17999999999995,4.8863000000000003E-5,0.99597000000000002,4.7175000000000002,4.7365884514593812]
[43,111,643.71,4.9502000000000001E-5,0.99221999999999999,4.5815000000000001,4.6174235552599221]
[43,112,648.96,5.0114999999999997E-5,0.98875999999999997,4.4574999999999996,4.5081718516121203]
[43,113,653.95000000000005,5.0705000000000003E-5,0.98555000000000004,4.3441000000000001,4.4077926031150119]
[43,114,658.69,5.1275E-5,0.98257000000000005,4.24,4.3152141832134099]
[43,115,663.23,5.1824999999999999E-5,0.97979000000000005,4.1440999999999999,4.2295798079180233]
[43,116,667.57,5.2357E-5,0.97719999999999996,4.0552999999999999,4.1499181334424886]
[43,117,671.72,5.2873E-5,0.97477000000000003,3.9731000000000001,4.0759358617930381]
[43,118,675.72,5.3372999999999999E-5,0.97248999999999997,3.8965999999999998,4.0068278337052305]
[43,119,679.56,5.3860000000000003E-5,0.97035000000000005,3.8252000000000002,3.9420827536455918]
[43,120,683.26,5.4333000000000003E-5,0.96833000000000002,3.7585000000000002,3.8814247209112596]
[43,121,686.83,5.4793000000000002E-5,0.96640999999999999,3.6960999999999999,3.8245672126737098]
[43,122,690.27,5.5241999999999997E-5,0.96460999999999997,3.6374,3.7708503954966255]
[43,123,693.61,5.5680000000000002E-5,0.96289000000000002,3.5823,3.7203626582475673]
[43,124,696.84,5.6107999999999999E-5,0.96126,3.5303,3.6725755778873563]
[43,125,699.97,5.6526000000000001E-5,0.9597,3.4811999999999999,3.6273835573616755]
[43,126,703,5.6935000000000003E-5,0.95821999999999996,3.4348000000000001,3.5845630439773748]
[43,127,705.95,5.7336000000000001E-5,0.95681000000000005,3.3908,3.5438592824071655]
[43,128,708.82,5.7728E-5,0.95545999999999998,3.3491,3.5052226152847843]
[43,129,711.61,5.8112999999999997E-5,0.95416999999999996,3.3094000000000001,3.4683546957041202]
[43,130,714.33,5.8489999999999997E-5,0.95291999999999999,3.2717000000000001,3.433341728581623]
[43,131,716.97,5.8860000000000002E-5,0.95172999999999996,3.2357999999999998,3.3999138411103988]
[43,132,719.56,5.9224000000000001E-5,0.95059000000000005,3.2014999999999998,3.3679083516552875]
[43,133,722.08,5.9580999999999998E-5,0.94948999999999995,3.1688000000000001,3.3373705884211526]
[43,134,724.54,5.9932000000000001E-5,0.94843,3.1375000000000002,3.3080986472380673]
[43,135,726.94,6.0278000000000001E-5,0.94740999999999997,3.1076000000000001,3.2801004844787371]
[43,136,729.29,6.0618000000000001E-5,0.94642999999999999,3.0789,3.253172448041588]
[43,137,731.59,6.0952999999999997E-5,0.94547999999999999,3.0514000000000001,3.2273554173541483]
[43,138,733.84,6.1282E-5,0.94457000000000002,3.0249999999999999,3.2025154303016188]
[43,139,736.05,6.1606999999999995E-5,0.94367999999999996,2.9996,3.1786198711427605]
[43,140,738.21,6.1927000000000005E-5,0.94281999999999999,2.9752000000000001,3.1556394645849686]
[43,141,740.33,6.2242999999999993E-5,0.94199999999999995,2.9517000000000002,3.1334394904458605]
[43,142,742.4,6.2553999999999998E-5,0.94118999999999997,2.9289999999999998,3.1120177647446319]
[43,143,744.44,6.2860999999999993E-5,0.94042000000000003,2.9072,3.0913847004529891]
[43,144,746.44,6.3163999999999994E-5,0.93966000000000005,2.8860999999999999,3.0714300917353081]
[43,145,748.4,6.3462999999999999E-5,0.93893000000000004,2.8658000000000001,3.0521977144196053]
[43,146,750.33,6.3758999999999997E-5,0.93822000000000005,2.8460999999999999,3.0335102641171576]
[43,147,752.23,6.4051000000000001E-5,0.93754000000000004,2.8271000000000002,3.0154446743605607]
[43,148,754.09,6.4338999999999995E-5,0.93686999999999998,2.8087,2.9979612966580209]
[43,149,755.92,6.4623999999999997E-5,0.93622000000000005,2.7909000000000002,2.9810300997628763]
[43,150,757.72,6.4906000000000005E-5,0.93559000000000003,2.7736999999999998,2.9646533203646892]
[43,151,759.5,6.5184999999999993E-5,0.93498000000000003,2.7570000000000001,{"$f":"F1603/E1603","v":2.9487261759609833}]
[43,152,761.24,6.546E-5,0.93437999999999999,2.7406999999999999,2.9331749395320963]
[43,153,762.96,6.5733000000000002E-5,0.93379999999999996,2.7250000000000001,2.9181837652602272]
[43,154,764.65,6.6002999999999998E-5,0.93323999999999996,2.7097000000000002,2.9035403540354041]
[43,155,766.31,6.6270000000000001E-5,0.93269000000000002,2.6947999999999999,2.8892772518200043]
[43,156,767.96,6.6533999999999997E-5,0.93215999999999999,2.6804000000000001,2.8754720219704772]
[43,157,769.57,6.6796000000000002E-5,0.93164000000000002,2.6663999999999999,2.8620497187754923]
[43,158,771.17,6.7055000000000001E-5,0.93113000000000001,2.6526999999999998,2.8489040198468527]
[43,159,772.74,6.7311999999999995E-5,0.93064000000000002,2.6394000000000002,2.8361127826012207]
[43,160,774.29,6.7565999999999997E-5,0.93015000000000003,2.6265000000000001,2.8237381067569745]
[43,161,775.82,6.7817999999999993E-5,0.92969000000000002,2.6139000000000001,2.8115823554087922]
[43,162,777.33,6.8067999999999999E-5,0.92923,2.6015999999999999,2.7997374170011731]
[43,163,778.82,6.8314999999999999E-5,0.92878000000000005,2.5895999999999999,2.7881737332845233]
[43,164,780.29,6.8559999999999994E-5,0.92835000000000001,2.5779000000000001,2.7768621748263049]
[43,165,781.74,6.8804000000000001E-5,0.92793000000000003,2.5665,2.7658336296918948]
[43,166,783.17,6.9045E-5,0.92750999999999995,2.5554000000000001,2.7551185431962999]
[43,167,784.59,6.9283999999999996E-5,0.92710999999999999,2.5445000000000002,2.7445502691158548]
[43,168,785.99,6.9521000000000001E-5,0.92671999999999999,2.5339,2.7342670925414367]
[43,169,787.37,6.9756000000000001E-5,0.92634000000000005,2.5234999999999999,2.7241617548632249]
[43,170,788.73,6.9989999999999999E-5,0.92596000000000001,2.5133999999999999,2.7143721111063113]
[43,171,790.08,7.0221000000000004E-5,0.92559999999999998,2.5034000000000001,2.7046240276577356]
[43,172,791.42,7.0450999999999993E-5,0.92523999999999995,2.4937,2.6951925986771004]
[43,173,792.73,7.0679000000000005E-5,0.92488999999999999,2.4842,2.6859410308252873]
[43,174,794.04,7.0905E-5,0.92454999999999998,2.4750000000000001,2.6769779892920882]
[43,175,795.33,7.1130000000000005E-5,0.92422000000000004,2.4659,2.6680876847503838]
[43,176,796.6,7.1353000000000006E-5,0.92390000000000005,2.4569999999999999,2.6593787206407615]
[43,177,797.86,7.1575000000000005E-5,0.92357999999999996,2.4483000000000001,2.6508802702527126]
[43,178,799.11,7.1795E-5,0.92327000000000004,2.4397000000000002,2.6424556196995463]
[43,179,800.34,7.2013000000000003E-5,0.92296999999999996,2.4314,2.6343218089428695]
[43,180,801.57,7.2230000000000005E-5,0.92266999999999999,2.4232,2.626291089988837]
[43,181,802.77,7.2445000000000002E-5,0.92239000000000004,2.4150999999999998,2.6183067899695351]
[43,182,803.97,7.2658999999999997E-5,0.92210000000000003,2.4072,2.6105628456783427]
[43,183,805.16,7.2872000000000003E-5,0.92183000000000004,2.3995000000000002,2.6029745180781707]
[43,184,806.33,7.3083000000000005E-5,0.92156000000000005,2.3919000000000001,2.5954902556534574]
[43,185,807.49,7.3293000000000005E-5,0.92130000000000001,2.3845000000000001,2.5881906002387929]
[43,186,808.64,7.3502000000000002E-5,0.92103999999999997,2.3772000000000002,2.5809953965082952]
[43,187,809.78,7.3708999999999995E-5,0.92079,2.37,2.5738767797217608]
[43,188,810.91,7.3916000000000002E-5,0.92054999999999998,2.3628999999999998,2.5668350442670143]
[43,189,812.03,7.4120000000000002E-5,0.92030999999999996,2.3559999999999999,2.5600069541784833]
[43,190,813.14,7.4324000000000002E-5,0.92007000000000005,2.3492000000000002,2.5532839892616868]
[43,191,814.23,7.4527E-5,0.91983999999999999,2.3424999999999998,2.5466385458340577]
[43,192,815.32,7.4727999999999993E-5,0.91961999999999999,2.3359999999999999,2.5401796394162806]
[43,193,816.4,7.4927999999999998E-5,0.9194,2.3294999999999999,2.5337176419403957]
[43,194,817.47,7.5127000000000001E-5,0.91918999999999995,2.3231999999999999,2.5274426397154017]
[43,195,818.53,7.5325000000000001E-5,0.91898000000000002,2.3169,2.5211647696359005]
[43,196,819.58,7.5522E-5,0.91876999999999998,2.3108,2.5151017120715742]
[43,197,820.62,7.5717999999999996E-5,0.91857,2.3048000000000002,2.5091174325309993]
[43,198,821.65,7.5912000000000001E-5,0.91837999999999997,2.2989000000000002,2.5032121779655481]
[43,199,822.67,7.6106000000000006E-5,0.91818,2.2930000000000001,2.4973316778845107]
[43,200,823.69,7.6298999999999996E-5,0.91800000000000004,2.2873000000000001,2.4916122004357297]
[44,74,207.14,1.9573999999999999E-5,0.91847999999999996,2.5672000000000001,2.7950526957582094]
[44,75,213.01,1.9760000000000001E-5,0.92562999999999995,2.6732,2.8879789980877892]
[44,76,219.13,1.9959E-5,0.93303999999999998,2.7894999999999999,2.9896896167366886]
[44,77,225.53,2.0173000000000002E-5,0.94074999999999998,2.9177,3.1014615997874038]
[44,78,232.24,2.0404E-5,0.94876000000000005,3.0596000000000001,3.2248408448922805]
[44,79,239.29,2.0653E-5,0.95708000000000004,3.2172000000000001,3.361474484891545]
[44,80,246.71,2.0922999999999999E-5,0.96574000000000004,3.3931,3.5134715347816181]
[44,81,254.55,2.1217E-5,0.97472999999999999,3.5901000000000001,3.6831738019759319]
[44,82,262.85000000000002,2.1537999999999999E-5,0.98406000000000005,3.8117000000000001,3.8734426762595775]
[44,83,271.68,2.1891000000000001E-5,0.99372000000000005,4.0617000000000001,4.0873686752807634]
[44,84,281.10000000000002,2.228E-5,1.0037,4.3448000000000002,4.3287835010461295]
[44,85,291.17,2.2711999999999999E-5,1.014,4.6654999999999998,4.6010848126232737]
[44,86,301.99,2.3193E-5,1.0245,5.0289000000000001,4.9086383601756953]
[44,87,313.64,2.3731999999999999E-5,1.0351999999999999,5.4389000000000003,5.2539605873261213]
[44,88,326.20999999999998,2.4337000000000001E-5,1.0459000000000001,5.8982000000000001,{"$f":"F1667/E1667","v":5.6393536666985371}]
[44,89,339.8,2.5021E-5,1.0564,6.4062000000000001,6.0641802347595606]
[44,90,354.49,2.5792999999999999E-5,1.0665,6.9576000000000002,6.5237693389592124]
[44,91,370.31,2.6665999999999998E-5,1.0755999999999999,7.5391000000000004,7.0092041651171453]
[44,92,387.27,2.7650000000000001E-5,1.0833999999999999,8.1226000000000003,7.4973232416466686]
[44,93,405.26,2.8748E-5,1.0891,8.6547999999999998,7.9467450188228819]
[44,94,423.99,2.9952999999999999E-5,1.0922000000000001,9.0547000000000004,8.2903314411279982]
[44,95,443,3.1241999999999997E-5,1.0926,9.2429000000000006,8.45954603697602]
[44,96,461.73,3.2580000000000003E-5,1.0904,9.1960999999999995,8.4336940572267043]
[44,97,479.73,3.3930000000000002E-5,1.0858000000000001,8.9992999999999999,8.2881746177933309]
[44,98,496.74,3.5265999999999997E-5,1.0795999999999999,8.6992999999999991,8.0578918117821416]
[44,99,512.59,3.6565E-5,1.0722,8.3209999999999997,7.7606789778026481]
[44,100,527.20000000000005,3.7808000000000001E-5,1.0643,7.9032,7.4257258291835004]
[44,101,540.55999999999995,3.8988E-5,1.0563,7.4790000000000001,7.0803748934961659]
[44,102,552.76,4.0098999999999997E-5,1.0484,7.0723000000000003,6.7458031285768794]
[44,103,563.9,4.1143999999999998E-5,1.0407999999999999,6.6965000000000003,6.4339930822444282]
[44,104,574.1,4.2126999999999998E-5,1.0337000000000001,6.3570000000000002,6.1497533133404279]
[44,105,583.47,4.3052E-5,1.0270999999999999,6.0537999999999998,5.8940706844513686]
[44,106,592.13,4.3925999999999999E-5,1.0208999999999999,5.7843,5.6658830443726131]
[44,107,600.15,4.4753000000000003E-5,1.0153000000000001,5.5446,5.4610459962572637]
[44,108,607.63,4.5538999999999999E-5,1.0101,5.3308999999999997,5.2775962775962775]
[44,109,614.61,4.6285999999999997E-5,1.0053000000000001,5.1395,5.1124042574355908]
[44,110,621.16999999999996,4.6999000000000002E-5,1.0008999999999999,4.9672999999999998,4.9628334498950943]
[44,111,627.34,4.7681E-5,0.99683999999999995,4.8117000000000001,4.826953172023595]
[44,112,633.16,4.8334999999999997E-5,0.99309999999999998,4.6704999999999997,4.702950357466519]
[44,113,638.67999999999995,4.8962999999999999E-5,0.98965000000000003,4.5416999999999996,4.5891982013843275]
[44,114,643.91999999999996,4.9567999999999997E-5,0.98643999999999998,4.4238,4.4846113296297796]
[44,115,648.91,5.0151000000000001E-5,0.98346,4.3155999999999999,4.3881805055619951]
[44,116,653.66,5.0713E-5,0.98068,4.2157,4.2987518864461398]
[44,117,658.21,5.1258000000000003E-5,0.97807999999999995,4.1234000000000002,4.2158105676427287]
[44,118,662.57,5.1785E-5,0.97563999999999995,4.0377999999999998,4.138616702882211]
[44,119,666.75,5.2296999999999998E-5,0.97335000000000005,3.9582000000000002,4.0665742024965326]
[44,120,670.76,5.2794000000000003E-5,0.97119999999999995,3.8839000000000001,3.9990733113673809]
[44,121,674.63,5.3276999999999998E-5,0.96916999999999998,3.8144999999999998,3.9358420091418429]
[44,122,678.36,5.3746999999999999E-5,0.96723999999999999,3.7494999999999998,3.8764939415243371]
[44,123,681.95,5.4205E-5,0.96541999999999994,3.6884000000000001,3.8205133517018504]
[44,124,685.43,5.4651999999999998E-5,0.96369000000000005,3.6309999999999998,3.7678091502454105]
[44,125,688.79,5.5087999999999998E-5,0.96204000000000001,3.5769000000000002,3.7180366720718476]
[44,126,692.05,5.5513999999999997E-5,0.96047000000000005,3.5257999999999998,3.6709111164325794]
[44,127,695.21,5.5930999999999997E-5,0.95898000000000005,3.4775,3.6262487226010967]
[44,128,698.27,5.6338000000000002E-5,0.95755000000000001,3.4317000000000002,3.5838337423633231]
[44,129,701.25,5.6737999999999998E-5,0.95618000000000003,3.3883000000000001,3.5435796607333345]
[44,130,704.15,5.7129000000000001E-5,0.95487,3.3471000000000002,3.5052939143548341]
[44,131,706.97,5.7512000000000001E-5,0.95360999999999996,3.3079000000000001,3.4688184897389922]
[44,132,709.72,5.7889000000000001E-5,0.95240999999999998,3.2706,3.4340252622295022]
[44,133,712.39,5.8257999999999997E-5,0.95125000000000004,3.2349000000000001,3.4006833114323261]
[44,134,715,5.8621E-5,0.95013000000000003,3.2008999999999999,3.3689074126698451]
[44,135,717.55,5.8977999999999997E-5,0.94906000000000001,3.1684999999999999,3.3385665816702841]
[44,136,720.04,5.9327999999999998E-5,0.94801999999999997,3.1374,3.3094238518174723]
[44,137,722.47,5.9673000000000003E-5,0.94701999999999997,3.1076000000000001,3.2814512893075123]
[44,138,724.85,6.0013000000000003E-5,0.94604999999999995,3.0790000000000002,3.2545848528090486]
[44,139,727.17,6.0346999999999997E-5,0.94511999999999996,3.0516000000000001,3.2287963433214832]
[44,140,729.45,6.0676E-5,0.94421999999999995,3.0253000000000001,3.2040202495181211]
[44,141,731.68,6.1001000000000001E-5,0.94335000000000002,3,3.1801558276355539]
[44,142,733.86,6.1320000000000002E-5,0.9425,2.9756999999999998,3.1572413793103444]
[44,143,736,6.1635000000000002E-5,0.94167999999999996,2.9521999999999999,3.1350352561379662]
[44,144,738.1,6.1946000000000006E-5,0.94089,2.9296000000000002,3.1136477165237171]
[44,145,740.16,6.2253000000000002E-5,0.94011999999999996,2.9077999999999999,3.0930094030549293]
[44,146,742.19,6.2556000000000002E-5,0.93937000000000004,2.8868,3.0731234763724622]
[44,147,744.17,6.2854999999999994E-5,0.93864999999999998,2.8664999999999998,3.0538539391679538]
[44,148,746.12,6.3150000000000004E-5,0.93794999999999995,2.8468,3.0351298043605737]
[44,149,748.04,6.3441999999999993E-5,0.93725999999999998,2.8277999999999999,3.0170923756481658]
[44,150,749.92,6.3730000000000001E-5,0.93659999999999999,2.8094000000000001,2.9995729233397395]
[44,151,751.78,6.4015000000000003E-5,0.93594999999999995,2.7915999999999999,2.9826379614295635]
[44,152,753.6,6.4295999999999996E-5,0.93532000000000004,2.7744,{"$f":"F1731/E1731","v":2.9662575375272633}]
[44,153,755.39,6.4574999999999998E-5,0.93471000000000004,2.7576999999999998,2.9503268393405437]
[44,154,757.15,6.4850000000000004E-5,0.93411999999999995,2.7414000000000001,2.934740718537233]
[44,155,758.89,6.5123000000000007E-5,0.93354000000000004,2.7256999999999998,2.91974634188144]
[44,156,760.6,6.5392E-5,0.93298000000000003,2.7103999999999999,2.905099787776801]
[44,157,762.29,6.5659000000000003E-5,0.93242999999999998,2.6955,2.8908336282616389]
[44,158,763.95,6.5922999999999999E-5,0.93189999999999995,2.6810999999999998,2.8770254319132955]
[44,159,765.58,6.6185000000000004E-5,0.93137999999999999,2.6669999999999998,2.863492881530632]
[44,160,767.19,6.6444000000000003E-5,0.93086999999999998,2.6533000000000002,2.8503443015673513]
[44,161,768.78,6.6699999999999995E-5,0.93037999999999998,2.64,2.8375502482856469]
[44,162,770.35,6.6953999999999996E-5,0.92989999999999995,2.6269999999999998,2.825034949994623]
[44,163,771.9,6.7206000000000007E-5,0.92942999999999998,2.6143999999999998,2.8129068353722171]
[44,164,773.43,6.7454999999999997E-5,0.92896999999999996,2.6021000000000001,2.8010592376503012]
[44,165,774.93,6.7702999999999999E-5,0.92852000000000001,2.5901000000000001,2.7894929565329774]
[44,166,776.42,6.7947999999999994E-5,0.92808999999999997,2.5783999999999998,2.7781788404141841]
[44,167,777.88,6.8190999999999998E-5,0.92766000000000004,2.5670000000000002,2.7671776297350323]
[44,168,779.33,6.8431999999999998E-5,0.92725000000000002,2.5558000000000001,2.7563224588837962]
[44,169,780.76,6.8670000000000005E-5,0.92684999999999995,2.5449000000000002,2.7457517397637163]
[44,170,782.18,6.8906999999999996E-5,0.92645,2.5343,2.7354957094284633]
[44,171,783.57,6.9141999999999996E-5,0.92606999999999995,2.5238999999999998,2.7253879296381482]
[44,172,784.95,6.9375999999999994E-5,0.92569000000000001,2.5137,2.71548790631853]
[44,173,786.32,6.9606999999999999E-5,0.92532000000000003,2.5038,2.7058747244196604]
[44,174,787.67,6.9837000000000002E-5,0.92496999999999996,2.4941,2.6964117755170438]
[44,175,789,7.0063999999999999E-5,0.92462,2.4845999999999999,2.6871579675974995]
[44,176,790.31,7.0290999999999995E-5,0.92427999999999999,2.4752999999999998,2.678084563119401]
[44,177,791.62,7.0514999999999998E-5,0.92393999999999998,2.4662000000000002,2.6692209450830142]
[44,178,792.91,7.0737999999999999E-5,0.92362,2.4571999999999998,2.6604014638054609]
[44,179,794.18,7.0958999999999996E-5,0.92330000000000001,2.4485000000000001,2.6519007906422614]
[44,180,795.44,7.1179000000000004E-5,0.92298999999999998,2.4399000000000002,2.643473927128138]
[44,181,796.69,7.1396999999999994E-5,0.92267999999999994,2.4316,2.6353665409459404]
[44,182,797.92,7.1613999999999996E-5,0.92239000000000004,2.4232999999999998,2.627196738906536]
[44,183,799.15,7.1829000000000006E-5,0.92210000000000003,2.4152999999999998,2.6193471423923649]
[44,184,800.35,7.2043000000000001E-5,0.92181000000000002,2.4074,2.6116010891615407]
[44,185,801.55,7.2255000000000005E-5,0.92154000000000003,2.3996,2.6039021637693427]
[44,186,802.74,7.2465999999999994E-5,0.92127000000000003,2.3919999999999999,2.5964158172956893]
[44,187,803.91,7.2675999999999993E-5,0.92100000000000004,2.3845999999999998,2.5891422366992396]
[44,188,805.07,7.2885000000000004E-5,0.92074,2.3772000000000002,2.5818363490236118]
[44,189,806.22,7.3091999999999997E-5,0.92049000000000003,2.37,2.5747156405827329]
[44,190,807.36,7.3298000000000002E-5,0.92023999999999995,2.363,2.5678083978092672]
[44,191,808.49,7.3502000000000002E-5,0.92,2.3559999999999999,2.560869565217391]
[44,192,809.61,7.3706000000000002E-5,0.91976999999999998,2.3492000000000002,2.554116790067082]
[44,193,810.72,7.3907999999999998E-5,0.91954000000000002,2.3424999999999998,2.5474693868673466]
[44,194,811.82,7.4109000000000005E-5,0.91930999999999996,2.3359999999999999,2.5410362119415648]
[44,195,812.91,7.4308999999999996E-5,0.91908999999999996,2.3294999999999999,2.5345722399329773]
[44,196,813.99,7.4507999999999999E-5,0.91888000000000003,2.3231000000000002,2.5281864878983109]
[44,197,815.06,7.4704999999999997E-5,0.91866000000000003,2.3169,2.5220429756384299]
[44,198,816.12,7.4901999999999995E-5,0.91846000000000005,2.3107000000000002,2.5158417350782831]
[44,199,817.17,7.5097000000000003E-5,0.91825999999999997,2.3047,2.5098555964541633]
[44,200,818.21,7.5291999999999997E-5,0.91805999999999999,2.2988,2.5039757750038123]
[45,74,203.68,1.9522E-5,0.91091999999999995,2.4668000000000001,2.7080314407412289]
[45,75,209.28,1.9695999999999999E-5,0.91754000000000002,2.5606,2.7907230202497981]
[45,76,215.1,1.9882E-5,0.92439000000000004,2.6627999999999998,2.8806023431668448]
[45,77,221.16,2.0081E-5,0.93149000000000004,2.7746,2.9786685847405767]
[45,78,227.49,2.0295000000000001E-5,0.93883000000000005,2.8973,3.0860752212860687]
[45,79,234.11,2.0523999999999999E-5,0.94643999999999995,3.0322,3.2037952749249823]
[45,80,241.05,2.0771000000000002E-5,0.95431999999999995,3.1812999999999998,3.3335778355268673]
[45,81,248.34,2.1038000000000001E-5,0.96245999999999998,3.3464999999999998,3.4770276167321237]
[45,82,256.01,2.1327000000000001E-5,0.97089000000000003,3.5301999999999998,3.6360452780438561]
[45,83,264.12,2.1642999999999999E-5,0.97958000000000001,3.7349000000000001,3.8127564874742239]
[45,84,272.7,2.1987000000000001E-5,0.98853000000000002,3.9638,4.0097923178861539]
[45,85,281.81,2.2365E-5,0.99772000000000005,4.2199,4.2295433588581961]
[45,86,291.51,2.2781000000000001E-5,1.0071000000000001,4.5068000000000001,4.4750273061265018]
[45,87,301.86,2.3241999999999999E-5,1.0165999999999999,4.8273999999999999,4.7485736769624243]
[45,88,312.94,2.3753000000000001E-5,1.0262,5.1840999999999999,5.0517442993568507]
[45,89,324.8,2.4321999999999999E-5,1.0358000000000001,5.5778999999999996,{"$f":"F1795/E1795","v":5.3851129561691442}]
[45,90,337.51,2.4956999999999998E-5,1.0450999999999999,6.0073999999999996,5.7481580709979907]
[45,91,351.14,2.5667E-5,1.0539000000000001,6.4679000000000002,6.1371097827118319]
[45,92,365.7,2.6460000000000001E-5,1.0619000000000001,6.9496000000000002,6.5444957152274226]
[45,93,381.19,2.7344000000000001E-5,1.0688,7.4343000000000004,6.9557447604790426]
[45,94,397.53,2.8320999999999999E-5,1.0742,7.8902999999999999,7.3452802085272753]
[45,95,414.56,2.9390000000000002E-5,1.0775999999999999,8.2697000000000003,7.6741833704528588]
[45,96,431.98,3.0537999999999998E-5,1.079,8.5173000000000005,7.8936978683966643]
[45,97,449.4,3.1742999999999997E-5,1.0782,8.5957000000000008,7.9722685958078285]
[45,98,466.43,3.2977E-5,1.0753999999999999,8.5106999999999999,7.9139854937697605]
[45,99,482.76,3.4214000000000001E-5,1.071,8.3355999999999995,7.7830065359477123]
[45,100,498.25,3.5437E-5,1.0654999999999999,8.0813000000000006,7.5845143125293299]
[45,101,512.77,3.6628000000000002E-5,1.0591999999999999,7.7721,7.3377077039274932]
[45,102,526.25,3.7774000000000001E-5,1.0525,7.4339000000000004,7.0630878859857482]
[45,103,538.71,3.8868999999999997E-5,1.0457000000000001,7.0888,6.7789997131108342]
[45,104,550.19000000000005,3.9909E-5,1.0390999999999999,6.7530000000000001,6.4988932730247333]
[45,105,560.78,4.0895000000000001E-5,1.0327,6.4367999999999999,6.2329815047932602]
[45,106,570.54999999999995,4.1828E-5,1.0266,6.1455000000000002,5.9862653419053187]
[45,107,579.6,4.2713000000000003E-5,1.0207999999999999,5.8806000000000003,5.7607758620689662]
[45,108,588,4.3551999999999999E-5,1.0155000000000001,5.6410999999999998,5.5549975381585419]
[45,109,595.83000000000004,4.4351000000000003E-5,1.0105,5.4253,5.3689262741217219]
[45,110,603.15,4.5111000000000002E-5,1.0058,5.2305999999999999,5.2004374627162457]
[45,111,610.03,4.5837999999999997E-5,1.0015000000000001,5.0545999999999998,5.0470294558162747]
[45,112,616.5,4.6533999999999999E-5,0.99755000000000005,4.8951000000000002,4.9071224500025066]
[45,113,622.6,4.7200999999999998E-5,0.99385999999999997,4.75,4.7793451794015258]
[45,114,628.38,4.7840999999999998E-5,0.99043999999999999,4.6174999999999997,4.6620693833043898]
[45,115,633.87,4.8458000000000003E-5,0.98724999999999996,4.4961000000000002,4.5541656115472273]
[45,116,639.09,4.9052999999999999E-5,0.98428000000000004,4.3844000000000003,4.4544235380176378]
[45,117,644.07000000000005,4.9626999999999998E-5,0.98150999999999999,4.2813999999999997,4.3620543855895502]
[45,118,648.82000000000005,5.0182999999999997E-5,0.97890999999999995,4.1860999999999997,4.2762868905210896]
[45,119,653.37,5.0720999999999998E-5,0.97646999999999995,4.0976999999999997,4.1964422870134257]
[45,120,657.74,5.1242000000000002E-5,0.97418000000000005,4.0153999999999996,4.1218255353220137]
[45,121,661.93,5.1749000000000002E-5,0.97201000000000004,3.9386999999999999,4.0521188053620847]
[45,122,665.96,5.2240999999999997E-5,0.96997,3.8668999999999998,3.9866181428291596]
[45,123,669.84,5.2719999999999997E-5,0.96804000000000001,3.7997000000000001,3.9251477211685466]
[45,124,673.59,5.3186999999999997E-5,0.96621000000000001,3.7366000000000001,3.8672752300224591]
[45,125,677.21,5.3641999999999999E-5,0.96445999999999998,3.6772,3.8127034817410781]
[45,126,680.71,5.4085999999999997E-5,0.96281000000000005,3.6212,3.7610743552725872]
[45,127,684.09,5.4518999999999998E-5,0.96123000000000003,3.5682999999999998,3.7122228811002564]
[45,128,687.37,5.4942999999999999E-5,0.95972000000000002,3.5183,3.6659650731463342]
[45,129,690.56,5.5358000000000001E-5,0.95826999999999996,3.4710000000000001,3.6221524205077902]
[45,130,693.65,5.5763999999999997E-5,0.95689000000000002,3.4260999999999999,3.580453343644515]
[45,131,696.65,5.6161E-5,0.95557000000000003,3.3834,3.5407139194407526]
[45,132,699.58,5.6551000000000001E-5,0.95428999999999997,3.3428,3.5029184000670655]
[45,133,702.42,5.6932999999999999E-5,0.95306999999999997,3.3041999999999998,3.4669016966224935]
[45,134,705.19,5.7308000000000001E-5,0.95189999999999997,3.2673000000000001,3.4323983611723921]
[45,135,707.89,5.7676000000000001E-5,0.95077,3.2321,3.3994551784343217]
[45,136,710.53,5.8038000000000002E-5,0.94967999999999997,3.1985000000000001,3.3679765815853764]
[45,137,713.1,5.8393999999999997E-5,0.94862000000000002,3.1663000000000001,3.3377959562311568]
[45,138,715.61,5.8743999999999999E-5,0.94760999999999995,3.1355,3.308850687519127]
[45,139,718.07,5.9088000000000001E-5,0.94662999999999997,3.1059999999999999,3.281113000855667]
[45,140,720.47,5.9426999999999999E-5,0.94567999999999997,3.0777000000000001,3.2544835462312833]
[45,141,722.82,5.9759999999999997E-5,0.94476000000000004,3.0505,3.2288623565773316]
[45,142,725.12,6.0087999999999998E-5,0.94386999999999999,3.0243000000000002,3.2041488764342549]
[45,143,727.37,6.0411999999999997E-5,0.94301000000000001,2.9992000000000001,3.1804540778994923]
[45,144,729.58,6.0730999999999998E-5,0.94216999999999995,2.9750000000000001,3.1576042540093616]
[45,145,731.74,6.1045999999999998E-5,0.94137000000000004,2.9516,3.1354302771492613]
[45,146,733.86,6.1356E-5,0.94057999999999997,2.9291,3.1141423377065216]
[45,147,735.95,6.1662999999999996E-5,0.93981999999999999,2.9074,3.0935711093613669]
[45,148,737.99,6.1964999999999994E-5,0.93908000000000003,2.8864999999999998,3.0737530348852067]
[45,149,740,6.2262999999999997E-5,0.93835999999999997,2.8662000000000001,3.0544780254912829]
[45,150,741.97,6.2558000000000007E-5,0.93766000000000005,2.8466,3.0358552140434698]
[45,151,743.91,6.2848999999999994E-5,0.93698000000000004,2.8277000000000001,3.0178872547973277]
[45,152,745.81,6.3137000000000002E-5,0.93632000000000004,2.8092999999999999,3.0003631237183868]
[45,153,747.68,6.3422000000000004E-5,0.93567999999999996,2.7915000000000001,{"$f":"F1859/E1859","v":2.9833917578659372}]
[45,154,749.52,6.3702999999999996E-5,0.93505000000000005,2.7743000000000002,2.9670071119191488]
[45,155,751.33,6.3980999999999996E-5,0.93445,2.7576000000000001,2.9510407191396011]
[45,156,753.12,6.4256000000000003E-5,0.93384999999999996,2.7414000000000001,2.9355892273919797]
[45,157,754.87,6.4528000000000003E-5,0.93328,2.7256999999999998,2.9205597462712154]
[45,158,756.6,6.4796999999999996E-5,0.93271000000000004,2.7103999999999999,2.9059407532888035]
[45,159,758.3,6.5063999999999999E-5,0.93217000000000005,2.6955,2.891639936921377]
[45,160,759.98,6.5327999999999995E-5,0.93162999999999996,2.6810999999999998,2.877859235962775]
[45,161,761.64,6.5588999999999998E-5,0.93110999999999999,2.6669999999999998,2.8643232271160226]
[45,162,763.26,6.5846999999999995E-5,0.93061000000000005,2.6533000000000002,2.8511406496813918]
[45,163,764.87,6.6104000000000003E-5,0.93010999999999999,2.64,2.8383739557686725]
[45,164,766.46,6.6357000000000002E-5,0.92962999999999996,2.6271,2.8259630175446144]
[45,165,768.02,6.6608999999999999E-5,0.92915999999999999,2.6143999999999998,2.8137242240303069]
[45,166,769.56,6.6858000000000003E-5,0.92869999999999997,2.6021000000000001,2.8018735867341449]
[45,167,771.08,6.7105000000000002E-5,0.92825999999999997,2.5901000000000001,2.790274276603538]
[45,168,772.58,6.7349999999999997E-5,0.92781999999999998,2.5783999999999998,2.7789873035718133]
[45,169,774.07,6.7591999999999999E-5,0.9274,2.5670000000000002,2.7679534181582923]
[45,170,775.53,6.7832999999999999E-5,0.92698000000000003,2.5558000000000001,2.7571252885714901]
[45,171,776.98,6.8071000000000006E-5,0.92657,2.5449000000000002,2.7465814779239563]
[45,172,778.4,6.8307999999999997E-5,0.92618,2.5341999999999998,2.7361851907836487]
[45,173,779.82,6.8542999999999997E-5,0.92579,2.5238,2.7261041920953994]
[45,174,781.21,6.8775999999999993E-5,0.92542000000000002,2.5137,2.7162801754878867]
[45,175,782.59,6.9006999999999998E-5,0.92505000000000004,2.5036999999999998,2.7065564023566289]
[45,176,783.95,6.9235999999999999E-5,0.92469000000000001,2.4940000000000002,2.6971201159307445]
[45,177,785.3,6.9463999999999998E-5,0.92434000000000005,2.4845000000000002,2.6878637730705153]
[45,178,786.63,6.9690000000000005E-5,0.92398999999999998,2.4752000000000001,2.6788168703124495]
[45,179,787.94,6.9913999999999995E-5,0.92366000000000004,2.4660000000000002,2.6698135677630299]
[45,180,789.24,7.0135999999999994E-5,0.92332999999999998,2.4571000000000001,2.6611287405369697]
[45,181,790.53,7.0357000000000004E-5,0.92301,2.4483999999999999,2.6526256486928634]
[45,182,791.8,7.0576999999999999E-5,0.92269999999999996,2.4398,2.6441963801885771]
[45,183,793.07,7.0795000000000002E-5,0.92239000000000004,2.4314,2.63597827383211]
[45,184,794.31,7.1011000000000002E-5,0.92208999999999997,2.4232,2.6279430424362049]
[45,185,795.55,7.1225999999999999E-5,0.92179999999999995,2.4150999999999998,2.6199826426556738]
[45,186,796.77,7.1439999999999994E-5,0.92152000000000001,2.4072,2.6122059206528343]
[45,187,797.98,7.1651999999999998E-5,0.92123999999999995,2.3994,2.6045330207112154]
[45,188,799.17,7.1863E-5,0.92096999999999996,2.3917999999999999,2.5970444205565872]
[45,189,800.36,7.2071999999999997E-5,0.92069999999999996,2.3843000000000001,2.5896600412729449]
[45,190,801.53,7.2280000000000006E-5,0.92044000000000004,2.3769999999999998,2.5824605623397501]
[45,191,802.7,7.2486999999999999E-5,0.92018999999999995,2.3698000000000001,2.5753377019963271]
[45,192,803.85,7.2693000000000003E-5,0.91993999999999998,2.3626999999999998,2.5683196730221534]
[45,193,804.99,7.2897000000000004E-5,0.91969999999999996,2.3557999999999999,2.5614874415570297]
[45,194,806.12,7.3100000000000001E-5,0.91946000000000006,2.3490000000000002,2.5547604028451483]
[45,195,807.24,7.3301999999999997E-5,0.91922999999999999,2.3422999999999998,2.548110918921271]
[45,196,808.35,7.3503000000000004E-5,0.91900000000000004,2.3357000000000001,2.5415669205658324]
[45,197,809.45,7.3701999999999993E-5,0.91878000000000004,2.3292000000000002,2.535100894664664]
[45,198,810.54,7.3900999999999996E-5,0.91856000000000004,2.3228,2.5287406375195958]
[45,199,811.62,7.4097999999999994E-5,0.91835,2.3166000000000002,2.5225676485000275]
[45,200,812.69,7.4295000000000006E-5,0.91813999999999996,2.3104,2.516391835667763]
[46,74,200.45,1.9477E-5,0.90402000000000005,2.3784000000000001,2.630915245237937]
[46,75,205.81,1.9641999999999999E-5,0.91019000000000005,2.4622000000000002,2.7051494742855886]
[46,76,211.37,1.9817E-5,0.91656000000000004,2.5529000000000002,2.7853059265078119]
[46,77,217.14,2.0003000000000001E-5,0.92313999999999996,2.6514000000000002,2.8721537361613625]
[46,78,223.14,2.0202000000000001E-5,0.92991999999999997,2.7587000000000002,2.9665992773571923]
[46,79,229.39,2.0414000000000001E-5,0.93693000000000004,2.8759000000000001,3.0694929183610302]
[46,80,235.92,2.0642E-5,0.94416,3.0043000000000002,3.1819818674800882]
[46,81,242.75,2.0886999999999998E-5,0.95162000000000002,3.1452,3.30510077551964]
[46,82,249.9,2.1151000000000001E-5,0.95931,3.3003999999999998,3.4403894465813969]
[46,83,257.42,2.1435999999999999E-5,0.96721999999999997,3.4716999999999998,3.5893591943921752]
[46,84,265.33,2.1744999999999999E-5,0.97535000000000005,3.6610999999999998,3.7536269031629668]
[46,85,273.68,2.2081000000000001E-5,0.98367000000000004,3.871,3.9352628422133438]
[46,86,282.5,2.2447999999999999E-5,0.99216000000000004,4.1036000000000001,4.1360264473472022]
[46,87,291.85000000000002,2.285E-5,1.0007999999999999,4.3612000000000002,4.3577138289368511]
[46,88,301.77,2.3292E-5,1.0095000000000001,4.6458000000000004,4.6020802377414558]
[46,89,312.33,2.3777999999999998E-5,1.0182,4.9587000000000003,4.8700648202710672]
[46,90,323.56,2.4315E-5,1.0267999999999999,5.2999000000000001,{"$f":"F1923/E1923","v":5.1615699259836392}]
[46,91,335.52,2.491E-5,1.0350999999999999,5.6677,5.4755096125978167]
[46,92,348.24,2.5567000000000001E-5,1.0429999999999999,6.0580999999999996,5.8083413231064238]
[46,93,361.75,2.6295000000000002E-5,1.0502,6.4634,6.1544467720434204]
[46,94,376.02,2.7097000000000002E-5,1.0564,6.8714000000000004,6.5045437334343053]
[46,95,391.01,2.7977999999999999E-5,1.0613999999999999,7.2618,6.8417184850197863]
[46,96,406.61,2.8937000000000001E-5,1.0649999999999999,7.6052999999999997,7.1411267605633801]
[46,97,422.62,2.9966000000000001E-5,1.0669,7.8654000000000002,7.3721998312869061]
[46,98,438.77,3.1053000000000002E-5,1.0669999999999999,8.0098000000000003,7.5068416119962516]
[46,99,454.78,3.2177E-5,1.0656000000000001,8.0253999999999994,7.5313438438438425]
[46,100,470.34,3.3318000000000002E-5,1.0626,7.9307999999999996,7.4635798983625063]
[46,101,485.28,3.4459000000000003E-5,1.0586,7.7729999999999997,7.3427167957679949]
[46,102,499.49,3.5584999999999999E-5,1.0536000000000001,7.5566000000000004,7.1721716021260438]
[46,103,512.86,3.6684999999999999E-5,1.0482,7.3005000000000004,6.9647967945048661]
[46,104,525.38,3.7747000000000003E-5,1.0425,7.0228000000000002,6.7364988009592333]
[46,105,537.04,3.8767999999999999E-5,1.0367,6.7382999999999997,6.4997588501977432]
[46,106,547.87,3.9743999999999998E-5,1.0310999999999999,6.4585999999999997,6.2637959460770052]
[46,107,557.94000000000005,4.0674999999999999E-5,1.0256000000000001,6.1913,6.0367589703588136]
[46,108,567.29999999999995,4.1561999999999999E-5,1.0203,5.9409999999999998,5.8227972165049495]
[46,109,576.02,4.2407000000000002E-5,1.0153000000000001,5.7096999999999998,5.6236580321087359]
[46,110,584.16999999999996,4.3213000000000001E-5,1.0105999999999999,5.4974999999999996,5.4398377201662376]
[46,111,591.79999999999995,4.3983000000000002E-5,1.0062,5.3037999999999998,5.2711190618167363]
[46,112,598.97,4.4719000000000003E-5,1.002,5.1271000000000004,5.1168662674650705]
[46,113,605.71,4.5425E-5,0.99817,4.9659000000000004,4.9750042577917597]
[46,114,612.08000000000004,4.6102E-5,0.99456,4.8186,4.8449565637065639]
[46,115,618.12,4.6752999999999998E-5,0.99119000000000002,4.6837,4.7253301586981307]
[46,116,623.84,4.7379999999999997E-5,0.98802999999999996,4.5598000000000001,4.6150420533789465]
[46,117,629.28,4.7985000000000002E-5,0.98509000000000002,4.4455999999999998,4.5128871473672456]
[46,118,634.47,4.8569000000000002E-5,0.98231999999999997,4.3402000000000003,4.4183158237641509]
[46,119,639.42999999999995,4.9134000000000001E-5,0.97972999999999999,4.2426000000000004,4.3303767364477972]
[46,120,644.16999999999996,4.9681000000000001E-5,0.97729999999999995,4.1520000000000001,4.2484395784303697]
[46,121,648.71,5.0212E-5,0.97499999999999998,4.0675999999999997,4.1718974358974359]
[46,122,653.08000000000004,5.0726999999999997E-5,0.97282999999999997,3.9887999999999999,4.1002025019787629]
[46,123,657.27,5.1227999999999998E-5,0.97077999999999998,3.9152,4.033045592204207]
[46,124,661.31,5.1715000000000002E-5,0.96884000000000003,3.8460999999999999,3.9697989348086367]
[46,125,665.2,5.2188999999999998E-5,0.96699999999999997,3.7812000000000001,3.9102378490175802]
[46,126,668.96,5.2651999999999997E-5,0.96523999999999999,3.7201,3.8540673822054621]
[46,127,672.59,5.3103000000000003E-5,0.96357000000000004,3.6625999999999999,3.8010730927695962]
[46,128,676.11,5.3542999999999999E-5,0.96197999999999995,3.6082000000000001,3.7508056300546793]
[46,129,679.51,5.3974000000000002E-5,0.96045999999999998,3.5567000000000002,3.7031214209857781]
[46,130,682.81,5.4394999999999997E-5,0.95899999999999996,3.508,3.6579770594369134]
[46,131,686.02,5.4806999999999999E-5,0.95760999999999996,3.4618000000000002,3.6150416140182333]
[46,132,689.13,5.5210999999999997E-5,0.95626999999999995,3.4178000000000002,3.5740951823229845]
[46,133,692.16,5.5606000000000003E-5,0.95498000000000005,3.3759999999999999,3.5351525686401808]
[46,134,695.1,5.5994E-5,0.95374000000000003,3.3361999999999998,3.4980183278461632]
[46,135,697.97,5.6373999999999999E-5,0.95255000000000001,3.2982999999999998,3.4626003884310532]
[46,136,700.76,5.6747999999999999E-5,0.95140999999999998,3.262,3.4285954530643994]
[46,137,703.48,5.7114999999999998E-5,0.95030000000000003,3.2273999999999998,3.3961906766284327]
[46,138,706.14,5.7475000000000001E-5,0.94923000000000002,3.1941999999999999,3.3650432455779948]
[46,139,708.73,5.783E-5,0.94820000000000004,3.1625000000000001,3.3352668213457077]
[46,140,711.27,5.8177999999999998E-5,0.94720000000000004,3.1320999999999999,3.3066934121621618]
[46,141,713.74,5.8520999999999998E-5,0.94623999999999997,3.1029,3.279189212039229]
[46,142,716.17,5.8859E-5,0.94530000000000003,3.0749,3.2528297894848195]
[46,143,718.54,5.9191000000000003E-5,0.94440000000000002,3.0478999999999998,3.227340110122829]
[46,144,720.86,5.9518999999999997E-5,0.94352000000000003,3.0219999999999998,3.2028997795489227]
[46,145,723.13,5.9842000000000001E-5,0.94267000000000001,2.9971000000000001,3.1793734817062176]
[46,146,725.36,6.016E-5,0.94184999999999997,2.9731000000000001,3.1566597653554176]
[46,147,727.55,6.0473999999999997E-5,0.94105000000000005,2.9499,3.1346899739652514]
[46,148,729.69,6.0782999999999997E-5,0.94027000000000005,2.9275000000000002,3.1134674082976166]
[46,149,731.79,6.1088999999999997E-5,0.93950999999999996,2.9060000000000001,3.0931017232387097]
[46,150,733.85,6.1390999999999995E-5,0.93877999999999995,2.8851,3.0732439975287078]
[46,151,735.88,6.1688999999999998E-5,0.93806999999999996,2.8650000000000002,3.0541430810067483]
[46,152,737.87,6.1983000000000006E-5,0.93737000000000004,2.8454999999999999,3.0356209394369351]
[46,153,739.83,6.2273000000000005E-5,0.93669999999999998,2.8266,3.0176150314935413]
[46,154,741.75,6.2561E-5,0.93603999999999998,2.8083,{"$f":"F1987/E1987","v":3.0001922994743815}]
[46,155,743.64,6.2843999999999997E-5,0.93540000000000001,2.7906,2.9833226427196919]
[46,156,745.5,6.3125000000000003E-5,0.93478000000000006,2.7734999999999999,2.9670082800231068]
[46,157,747.33,6.3403000000000003E-5,0.93416999999999994,2.7568000000000001,2.9510688632689983]
[46,158,749.13,6.3676999999999994E-5,0.93357999999999997,2.7406000000000001,2.9355813106536131]
[46,159,750.9,6.3948999999999994E-5,0.93301000000000001,2.7248999999999999,2.9205474753753977]
[46,160,752.65,6.4218000000000001E-5,0.93245,2.7097000000000002,2.9060003217330692]
[46,161,754.37,6.4484000000000001E-5,0.93189999999999995,2.6949000000000001,2.8918338877561971]
[46,162,756.06,6.4746999999999995E-5,0.93137000000000003,2.6804000000000001,2.8779110342828309]
[46,163,757.73,6.5007999999999998E-5,0.93084999999999996,2.6663999999999999,2.864478702261374]
[46,164,759.38,6.5265999999999995E-5,0.93033999999999994,2.6528,2.8514306597587979]
[46,165,761,6.5522E-5,0.92984999999999995,2.6395,2.8386298865408399]
[46,166,762.6,6.5775E-5,0.92935999999999996,2.6265000000000001,2.8261384178359301]
[46,167,764.18,6.6025999999999994E-5,0.92888999999999999,2.6139000000000001,2.8140038110002261]
[46,168,765.74,6.6274999999999998E-5,0.92842999999999998,2.6015999999999999,2.8021498659026527]
[46,169,767.27,6.6520999999999995E-5,0.92798999999999998,2.5895999999999999,2.7905473119322406]
[46,170,768.79,6.6766000000000004E-5,0.92754999999999999,2.5779000000000001,2.7792571829011914]
[46,171,770.29,6.7008000000000006E-5,0.92712000000000006,2.5665,2.7682500647165416]
[46,172,771.77,6.7248000000000004E-5,0.92671000000000003,2.5552999999999999,2.7573890429584225]
[46,173,773.23,6.7486999999999999E-5,0.92630000000000001,2.5444,2.746842275720609]
[46,174,774.67,6.7723000000000002E-5,0.92589999999999995,2.5337999999999998,2.7365806242574791]
[46,175,776.09,6.7957E-5,0.92551000000000005,2.5234000000000001,2.7264967423366575]
[46,176,777.5,6.8189999999999996E-5,0.92513000000000001,2.5131999999999999,2.716591181779858]
[46,177,778.89,6.8421000000000001E-5,0.92476000000000003,2.5032000000000001,2.7068644837579479]
[46,178,780.27,6.8649E-5,0.9244,2.4935,2.6974253569883166]
[46,179,781.63,6.8876999999999998E-5,0.92405000000000004,2.484,2.6881662247713867]
[46,180,782.97,6.9102000000000003E-5,0.92371000000000003,2.4746999999999999,2.6790875924261943]
[46,181,784.3,6.9326000000000007E-5,0.92337000000000002,2.4655999999999998,2.6702188721747508]
[46,182,785.61,6.9548000000000006E-5,0.92303999999999997,2.4565999999999999,2.6614231235916104]
[46,183,786.91,6.9769000000000002E-5,0.92271999999999998,2.4479000000000002,2.6529174614184154]
[46,184,788.2,6.9987999999999995E-5,0.9224,2.4392999999999998,2.6445143104943623]
[46,185,789.47,7.0205999999999998E-5,0.92210000000000003,2.4308999999999998,2.6362650471749265]
[46,186,790.73,7.0421999999999998E-5,0.92179999999999995,2.4226999999999999,2.6282273812106749]
[46,187,791.98,7.0636000000000006E-5,0.92149999999999999,2.4146000000000001,2.6202930005425937]
[46,188,793.21,7.0850000000000001E-5,0.92122000000000004,2.4066999999999998,2.6125138403421548]
[46,189,794.43,7.1062000000000005E-5,0.92093999999999998,2.3988999999999998,2.6048385345407952]
[46,190,795.64,7.1272000000000005E-5,0.92066000000000003,2.3913000000000002,2.597375795624878]
[46,191,796.84,7.1481000000000002E-5,0.9204,2.3837999999999999,2.5899608865710562]
[46,192,798.02,7.1688999999999998E-5,0.92013999999999996,2.3765000000000001,2.5827591453474472]
[46,193,799.2,7.1895000000000002E-5,0.91988000000000003,2.3693,2.5756620428751575]
[46,194,800.36,7.2101000000000006E-5,0.91962999999999995,2.3622000000000001,2.568641736350489]
[46,195,801.51,7.2305000000000007E-5,0.91939000000000004,2.3552,2.5616985174952958]
[46,196,802.65,7.2507000000000002E-5,0.91915000000000002,2.3483999999999998,2.5549692650818687]
[46,197,803.78,7.2708999999999998E-5,0.91891,2.3416999999999999,2.5483453221751855]
[46,198,804.9,7.2909000000000003E-5,0.91869000000000001,2.3351000000000002,2.5417714354134695]
[46,199,806.01,7.3108999999999994E-5,0.91846000000000005,2.3285999999999998,2.5353308799512222]
[46,200,807.11,7.3306999999999995E-5,0.91823999999999995,2.3222,2.5289684614044261]
[47,74,197.42,1.944E-5,0.89770000000000005,2.2997999999999998,2.5618803609223568]
[47,75,202.57,1.9596E-5,0.90347999999999995,2.3752,2.6289458538097135]
[47,76,207.89,1.9760999999999999E-5,0.90942999999999996,2.4563999999999999,2.7010325148719527]
[47,77,213.4,1.9936E-5,0.91554999999999997,2.5440999999999998,2.7787668614494017]
[47,78,219.12,2.0123E-5,0.92186000000000001,2.6389999999999998,2.8626906471698521]
[47,79,225.05,2.0321000000000001E-5,0.92835999999999996,2.742,2.9535955879184801]
[47,80,231.23,2.0531999999999999E-5,0.93505000000000005,2.8538999999999999,3.0521362493984276]
[47,81,237.67,2.0758999999999999E-5,0.94193000000000005,2.9759000000000002,3.1593642839701466]
[47,82,244.39,2.1001000000000001E-5,0.94901000000000002,3.1091000000000002,3.2761509362388175]
[47,83,251.41,2.1262000000000001E-5,0.95626999999999995,3.2549000000000001,3.4037458040093282]
[47,84,258.77,2.1542000000000001E-5,0.96372000000000002,3.4146999999999998,3.5432490764952473]
[47,85,266.49,2.1846000000000001E-5,0.97133999999999998,3.5901999999999998,3.6961311178372145]
[47,86,274.61,2.2174000000000001E-5,0.97909999999999997,3.7829999999999999,3.8637524256970686]
[47,87,283.16000000000003,2.2531000000000002E-5,0.98699000000000003,3.9948000000000001,4.0474574210478327]
[47,88,292.18,2.2918999999999999E-5,0.99495999999999996,4.2271000000000001,4.2485125030151965]
[47,89,301.72000000000003,2.3343E-5,1.0029999999999999,4.4812000000000003,4.4677966101694926]
[47,90,311.8,2.3807000000000001E-5,1.0108999999999999,4.7576000000000001,4.7063013156593136]
[47,91,322.48,2.4315999999999999E-5,1.0186999999999999,5.0557999999999996,{"$f":"F2051/E2051","v":4.9629920486895065}]
[47,92,333.78,2.4875000000000002E-5,1.0263,5.3742000000000001,5.2364805612394036]
[47,93,345.72,2.5488000000000001E-5,1.0334000000000001,5.7092999999999998,5.5247725953164304]
[47,94,358.32,2.6160999999999999E-5,1.04,6.0551000000000004,5.8222115384615387]
[47,95,371.57,2.6897E-5,1.0458000000000001,6.4027000000000003,6.1222987186842603]
[47,96,385.43,2.7699E-5,1.0505,6.7388000000000003,6.4148500713945742]
[47,97,399.82,2.8566000000000001E-5,1.0541,7.0442,6.682667678588369]
[47,98,414.6,2.9496999999999999E-5,1.0563,7.2953000000000001,6.9064659661081134]
[47,99,429.6,3.0480999999999998E-5,1.0570999999999999,7.4676999999999998,7.0643269321729258]
[47,100,444.58,3.1506E-5,1.0566,7.5449999999999999,7.1408290743895515]
[47,101,459.33,3.2555999999999998E-5,1.0548,7.5259,7.1349070913917334]
[47,102,473.64,3.3615999999999998E-5,1.0519000000000001,7.4329999999999998,7.066261051430744]
[47,103,487.39,3.4672999999999998E-5,1.0482,7.2911000000000001,6.9558290402594922]
[47,104,500.5,3.5716999999999997E-5,1.0438000000000001,7.1059000000000001,6.807721785782717]
[47,105,512.91,3.6736999999999997E-5,1.0390999999999999,6.8914,6.6320854585699172]
[47,106,524.58000000000004,3.7727E-5,1.0342,6.6603000000000003,6.4400502804099791]
[47,107,535.53,3.8682E-5,1.0291999999999999,6.4231999999999996,6.2409638554216871]
[47,108,545.77,3.96E-5,1.0243,6.1879999999999997,6.0411988675192809]
[47,109,555.36,4.0481000000000001E-5,1.0195000000000001,5.9607999999999999,5.84678764100049]
[47,110,564.33000000000004,4.1323999999999999E-5,1.0148999999999999,5.7450999999999999,5.6607547541629719]
[47,111,572.73,4.2132000000000003E-5,1.0105999999999999,5.5430000000000001,5.4848604789234123]
[47,112,580.62,4.2905999999999999E-5,1.0064,5.3552999999999997,5.321244038155803]
[47,113,588.04999999999995,4.3648E-5,1.0024,5.1818,5.169393455706305]
[47,114,595.04,4.4360000000000002E-5,0.99872000000000005,5.0218999999999996,5.0283362704261449]
[47,115,601.66,4.5043999999999998E-5,0.99521999999999999,4.8746999999999998,4.8981129800446128]
[47,116,607.91999999999996,4.5702999999999999E-5,0.99192000000000002,4.7390999999999996,4.7777038470844415]
[47,117,613.87,4.6338000000000003E-5,0.98882999999999999,4.6139999999999999,4.6661205667303784]
[47,118,619.52,4.6950000000000003E-5,0.98590999999999995,4.4984999999999999,4.5627897069712251]
[47,119,624.91,4.7542E-5,0.98316999999999999,4.3916000000000004,4.4667758373424746]
[47,120,630.05999999999995,4.8115000000000003E-5,0.98058999999999996,4.2923,4.3772626683935183]
[47,121,634.98,4.867E-5,0.97816000000000003,4.2000999999999999,4.2938783021182623]
[47,122,639.70000000000005,4.9208E-5,0.97585999999999995,4.1140999999999996,4.2158711290553974]
[47,123,644.23,4.9731000000000002E-5,0.97369000000000006,4.0338000000000003,4.142796988774661]
[47,124,648.59,5.0238999999999998E-5,0.97162999999999999,3.9586000000000001,4.0741846176013503]
[47,125,652.77,5.0732999999999997E-5,0.96967999999999999,3.8881000000000001,4.0096732942826501]
[47,126,656.81,5.1214000000000001E-5,0.96782000000000001,3.8218000000000001,3.9488747907668782]
[47,127,660.71,5.1684000000000002E-5,0.96606000000000003,3.7593999999999999,3.8914767198724713]
[47,128,664.47,5.2141000000000001E-5,0.96436999999999995,3.7004999999999999,3.8372201540902351]
[47,129,668.12,5.2587999999999999E-5,0.96275999999999995,3.6448999999999998,3.7858864099048568]
[47,130,671.64,5.3025000000000001E-5,0.96123000000000003,3.5922999999999998,3.7371908908377804]
[47,131,675.06,5.3452000000000003E-5,0.95974999999999999,3.5424000000000002,3.6909611878093256]
[47,132,678.37,5.3869999999999998E-5,0.95833999999999997,3.4950000000000001,3.6469311517832921]
[47,133,681.59,5.4279E-5,0.95699000000000001,3.45,3.6050533443400665]
[47,134,684.72,5.4679999999999998E-5,0.95567999999999997,3.4072,3.5652101121714384]
[47,135,687.76,5.5072999999999999E-5,0.95443,3.3664000000000001,3.527131376842723]
[47,136,690.72,5.5458000000000003E-5,0.95321999999999996,3.3273999999999999,3.4906946979710876]
[47,137,693.61,5.5835999999999999E-5,0.95206000000000002,3.2902999999999998,3.4559796651471544]
[47,138,696.42,5.6208000000000001E-5,0.95094000000000001,3.2547000000000001,3.4226134140955264]
[47,139,699.16,5.6573000000000002E-5,0.94984999999999997,3.2206999999999999,3.3907459072485131]
[47,140,701.84,5.6932000000000003E-5,0.94879999999999998,3.1882000000000001,3.3602445193929178]
[47,141,704.45,5.7284000000000002E-5,0.94779000000000002,3.157,3.3309066354361199]
[47,142,707,5.7630999999999998E-5,0.94681000000000004,3.1269999999999998,3.302668962093767]
[47,143,709.5,5.7973000000000002E-5,0.94586000000000003,3.0981999999999998,3.2755376059882009]
[47,144,711.94,5.8309E-5,0.94494,3.0706000000000002,3.2495184879463248]
[47,145,714.33,5.8641000000000003E-5,0.94404999999999994,3.044,3.2244054869975112]
[47,146,716.67,5.8967E-5,0.94318000000000002,3.0184000000000002,3.2002374944337242]
[47,147,718.97,5.9289000000000001E-5,0.94233999999999996,2.9937,3.1768788335420339]
[47,148,721.21,5.9605999999999998E-5,0.94152000000000002,2.97,3.1544736171297476]
[47,149,723.42,5.9919E-5,0.94072999999999996,2.9470000000000001,3.132673562020984]
[47,150,725.58,6.0228E-5,0.93996000000000002,2.9249000000000001,3.1117281586450489]
[47,151,727.7,6.0532000000000003E-5,0.93920999999999999,2.9035000000000002,3.0914279021731033]
[47,152,729.78,6.0832999999999998E-5,0.93847999999999998,2.8828,3.0717756372005796]
[47,153,731.83,6.1130000000000006E-5,0.93776999999999999,2.8628,3.0527741343826311]
[47,154,733.83,6.1424E-5,0.93708000000000002,2.8433999999999999,3.0343193750800359]
[47,155,735.81,6.1712999999999997E-5,0.93640999999999996,2.8247,{"$f":"F2115/E2115","v":3.0165205412159204}]
[47,156,737.75,6.2000000000000003E-5,0.93576000000000004,2.8065000000000002,2.9991664529366506]
[47,157,739.66,6.2283E-5,0.93511999999999995,2.7888999999999999,2.982397981007785]
[47,158,741.53,6.2563000000000004E-5,0.9345,2.7717999999999998,2.9660781166399142]
[47,159,743.38,6.2840000000000001E-5,0.93389,2.7553000000000001,2.9503474713296001]
[47,160,745.2,6.3114000000000006E-5,0.93330999999999997,2.7391999999999999,2.9349305161200459]
[47,161,746.98,6.3385000000000004E-5,0.93272999999999995,2.7235,2.9199232360919023]
[47,162,748.75,6.3652999999999995E-5,0.93217000000000005,2.7082999999999999,2.9053713378461006]
[47,163,750.48,6.3918999999999996E-5,0.93162999999999996,2.6936,2.8912765797580584]
[47,164,752.19,6.4182000000000003E-5,0.93108999999999997,2.6791999999999998,2.8774876757348911]
[47,165,753.88,6.4442000000000004E-5,0.93057000000000001,2.6652,2.8640510654759987]
[47,166,755.54,6.4698999999999998E-5,0.93006999999999995,2.6516000000000002,2.85096820669412]
[47,167,757.18,6.4955000000000004E-5,0.92957000000000001,2.6383999999999999,2.8383015803005689]
[47,168,758.79,6.5207000000000001E-5,0.92908999999999997,2.6254,2.8257757590760852]
[47,169,760.39,6.5457999999999996E-5,0.92862,2.6128,2.8136374405031122]
[47,170,761.96,6.5705999999999997E-5,0.92815999999999999,2.6006,2.801887605585244]
[47,171,763.51,6.5951999999999995E-5,0.92771000000000003,2.5886,2.7903116275560249]
[47,172,765.04,6.6196000000000001E-5,0.92727000000000004,2.5769000000000002,2.7790179775038557]
[47,173,766.55,6.6438000000000003E-5,0.92684,2.5655000000000001,2.7680074230719436]
[47,174,768.04,6.6678000000000001E-5,0.92642999999999998,2.5543999999999998,2.7572509525814146]
[47,175,769.52,6.6915999999999994E-5,0.92601999999999995,2.5434999999999999,2.7467009351849851]
[47,176,770.97,6.7151999999999997E-5,0.92562,2.5329000000000002,2.7364361184935504]
[47,177,772.41,6.7385999999999995E-5,0.92523,2.5225,2.7263491240015996]
[47,178,773.83,6.7618000000000002E-5,0.92484999999999995,2.5123000000000002,2.716440503865492]
[47,179,775.24,6.7848000000000005E-5,0.92447999999999997,2.5024000000000002,2.7068189685012118]
[47,180,776.62,6.8076000000000003E-5,0.92412000000000005,2.4925999999999999,2.6972687529758037]
[47,181,778,6.8303E-5,0.92376000000000003,2.4830999999999999,2.688035853468433]
[47,182,779.35,6.8528000000000005E-5,0.92342000000000002,2.4738000000000002,2.6789543219769989]
[47,183,780.69,6.8751999999999995E-5,0.92308000000000001,2.4647000000000001,2.6700827663907787]
[47,184,782.02,6.8973999999999994E-5,0.92274999999999996,2.4558,2.6613925765375237]
[47,185,783.33,6.9194000000000002E-5,0.92242999999999997,2.4470000000000001,2.652775820387455]
[47,186,784.63,6.9412999999999994E-5,0.92210999999999999,2.4384999999999999,2.6444784244829793]
[47,187,785.91,6.9629999999999996E-5,0.92179999999999995,2.4300999999999999,2.636255152961597]
[47,188,787.19,6.9845999999999995E-5,0.92149999999999999,2.4218000000000002,2.6281063483450899]
[47,189,788.44,7.0060000000000003E-5,0.92120999999999997,2.4138000000000002,2.6202494545217707]
[47,190,789.69,7.0272999999999996E-5,0.92091999999999996,2.4058000000000002,2.6123876123876126]
[47,191,790.92,7.0483999999999998E-5,0.92064000000000001,2.3980999999999999,2.6048183872088981]
[47,192,792.14,7.0693999999999998E-5,0.92035999999999996,2.3904999999999998,2.5973532096136296]
[47,193,793.35,7.0902999999999995E-5,0.92008999999999996,2.383,2.5899640252583986]
[47,194,794.54,7.1110000000000002E-5,0.91983000000000004,2.3755999999999999,2.5826511420588587]
[47,195,795.73,7.1316999999999995E-5,0.91957,2.3683999999999998,2.5755516165164152]
[47,196,796.9,7.1520999999999995E-5,0.91932000000000003,2.3614000000000002,2.5686376887264499]
[47,197,798.06,7.1724999999999995E-5,0.91908000000000001,2.3544,2.5616921269095183]
[47,198,799.21,7.1927000000000004E-5,0.91883999999999999,2.3475999999999999,2.5549606024988027]
[47,199,800.35,7.2129E-5,0.91859999999999997,2.3409,2.5483344219464401]
[47,200,801.48,7.2329000000000005E-5,0.91837000000000002,2.3342999999999998,2.5417859903960274]
[48,74,194.57,1.9409E-5,0.89188000000000001,2.2294999999999998,2.4997757545858184]
[48,75,199.52,1.9558000000000001E-5,0.89731000000000005,2.2978000000000001,2.5607649530262675]
[48,76,204.63,1.9714000000000001E-5,0.90288999999999997,2.3711000000000002,2.6261227835062968]
[48,77,209.91,1.9879000000000001E-5,0.90861999999999998,2.4497,2.6960665624793645]
[48,78,215.38,2.0055E-5,0.91452,2.5344000000000002,2.7712898569741506]
[48,79,221.04,2.0241000000000002E-5,0.92057,2.6257000000000001,2.8522545814006541]
[48,80,226.91,2.0438E-5,0.92679999999999996,2.7244000000000002,2.939577039274925]
[48,81,233.01,2.0649000000000002E-5,0.93318999999999996,2.8311999999999999,3.0338944909396801]
[48,82,239.35,2.0873000000000002E-5,0.93974000000000002,2.9470999999999998,3.1360801923936403]
[48,83,245.96,2.1112999999999999E-5,0.94645999999999997,3.073,3.2468355767808466]
[48,84,252.86,2.1370999999999999E-5,0.95333999999999997,3.21,3.3671093209138396]
[48,85,260.06,2.1647000000000001E-5,0.96036999999999995,3.3593000000000002,3.4979226756354325]
[48,86,267.60000000000002,2.1943999999999999E-5,0.96753,3.5219999999999998,3.6401972031874981]
[48,87,275.5,2.2265000000000001E-5,0.9748,3.6995,3.7951374640951991]
[48,88,283.8,2.2612E-5,0.98216999999999999,3.8929,3.9635704613254323]
[48,89,292.51,2.2988000000000001E-5,0.98958000000000002,4.1032000000000002,4.1464055457871014]
[48,90,301.69,2.3396000000000001E-5,0.99697999999999998,4.3311000000000002,4.3442195430199204]
[48,91,311.35000000000002,2.3839999999999999E-5,1.0043,4.5768000000000004,4.55720402270238]
[48,92,321.52,2.4324E-5,1.0115000000000001,4.8395999999999999,{"$f":"F2179/E2179","v":4.7845773603559065}]
[48,93,332.23,2.4851E-5,1.0185,5.1177999999999999,5.0248404516445753]
[48,94,343.5,2.5426E-5,1.0249999999999999,5.4084000000000003,5.2764878048780499]
[48,95,355.32,2.6050999999999998E-5,1.0310999999999999,5.7068000000000003,5.53467170982446]
[48,96,367.7,2.6730999999999999E-5,1.0364,6.0063000000000004,5.7953492859899658]
[48,97,380.6,2.7467999999999999E-5,1.0409999999999999,6.2976000000000001,6.0495677233429399]
[48,98,393.95,2.8260999999999999E-5,1.0445,6.5678999999999998,6.2880804212541888]
[48,99,407.67,2.9108E-5,1.0469999999999999,6.8011999999999997,6.4958930276981857]
[48,100,421.63,3.0003999999999999E-5,1.0484,6.9802999999999997,6.658050362457077]
[48,101,435.65,3.0941000000000001E-5,1.0485,7.0907,6.7627086313781595]
[48,102,449.57,3.1908E-5,1.0476000000000001,7.1256000000000004,6.801832760595647]
[48,103,463.21,3.2891000000000001E-5,1.0457000000000001,7.0884999999999998,6.778712823945682]
[48,104,476.44,3.3878999999999999E-5,1.0429999999999999,7.0010000000000003,6.7123681687440087]
[48,105,489.18,3.4863000000000001E-5,1.0396000000000001,6.8741000000000003,6.6122547133512883]
[48,106,501.34,3.5834000000000003E-5,1.0357000000000001,6.7148000000000003,6.4833445978565223]
[48,107,512.9,3.6785000000000001E-5,1.0315000000000001,6.5332999999999997,6.3337857489093548]
[48,108,523.84,3.7710999999999999E-5,1.0271999999999999,6.3388999999999998,6.1710475077881624]
[48,109,534.15,3.8608E-5,1.0228999999999999,6.1390000000000002,6.0015641802717772]
[48,110,543.86,3.9474000000000002E-5,1.0185999999999999,5.9397000000000002,5.8312389554290203]
[48,111,553,4.0309000000000003E-5,1.0144,5.7451999999999996,5.6636435331230279]
[48,112,561.59,4.1112000000000002E-5,1.0104,5.5587,5.5014845605700717]
[48,113,569.69000000000005,4.1884000000000001E-5,1.0065,5.3819999999999997,5.3472429210134127]
[48,114,577.33000000000004,4.2626999999999997E-5,1.0027999999999999,5.2159000000000004,5.2013362584762675]
[48,115,584.54,4.3340999999999997E-5,0.99922999999999995,5.0606999999999998,5.064599741801187]
[48,116,591.37,4.4029999999999997E-5,0.99585999999999997,4.9162999999999997,4.9367380957162652]
[48,117,597.84,4.4693000000000001E-5,0.99267000000000005,4.7821999999999996,4.817512365640142]
[48,118,603.99,4.5333000000000001E-5,0.98963999999999996,4.6577000000000002,4.7064589143526945]
[48,119,609.84,4.5952000000000003E-5,0.98677999999999999,4.5420999999999996,4.6029510123837127]
[48,120,615.41999999999996,4.655E-5,0.98407,4.4347000000000003,4.5064883595679168]
[48,121,620.75,4.7128E-5,0.98150999999999999,4.3346999999999998,4.4163584680747014]
[48,122,625.85,4.7689999999999999E-5,0.97907999999999995,4.2416,4.3322302569759366]
[48,123,630.73,4.8233999999999999E-5,0.97679000000000005,4.1546000000000003,4.2533195466784059]
[48,124,635.41999999999996,4.8763000000000001E-5,0.97460999999999998,4.0731999999999999,4.1793127507413219]
[48,125,639.92999999999995,4.9277000000000003E-5,0.97253999999999996,3.9969999999999999,4.1098566639932548]
[48,126,644.26,4.9777000000000001E-5,0.97058,3.9253999999999998,4.0443858311525069]
[48,127,648.44000000000005,5.0263999999999999E-5,0.96870000000000001,3.8580999999999999,3.9827604005368018]
[48,128,652.47,5.0739000000000003E-5,0.96692,3.7946,3.9244198072229346]
[48,129,656.37,5.1202999999999997E-5,0.96521999999999997,3.7347999999999999,3.869376929611902]
[48,130,660.13,5.1654999999999999E-5,0.96358999999999995,3.6781999999999999,3.8171836569495325]
[48,131,663.77,5.2096999999999999E-5,0.96204000000000001,3.6246,3.7676188100286891]
[48,132,667.31,5.2528999999999998E-5,0.96053999999999995,3.5737000000000001,3.7205113790159703]
[48,133,670.73,5.2951999999999997E-5,0.95911000000000002,3.5255000000000001,3.6758036095963966]
[48,134,674.05,5.3366999999999999E-5,0.95774000000000004,3.4796,3.6331363418046649]
[48,135,677.28,5.3771999999999999E-5,0.95642000000000005,3.4359000000000002,3.5924593797703936]
[48,136,680.42,5.4169999999999998E-5,0.95513999999999999,3.3942999999999999,3.553719873526394]
[48,137,683.48,5.4559999999999999E-5,0.95391999999999999,3.3546,3.5166470982891647]
[48,138,686.45,5.4942999999999999E-5,0.95274000000000003,3.3166000000000002,3.4811176186577661]
[48,139,689.35,5.5318999999999997E-5,0.9516,3.2803,3.4471416561580495]
[48,140,692.18,5.5687999999999999E-5,0.95048999999999995,3.2456,3.4146598070468919]
[48,141,694.93,5.6051000000000003E-5,0.94943,3.2122999999999999,3.3833984601287086]
[48,142,697.63,5.6406999999999997E-5,0.94838999999999996,3.1804000000000001,3.3534727274644398]
[48,143,700.26,5.6758000000000001E-5,0.94740000000000002,3.1497999999999999,3.3246780662866793]
[48,144,702.83,5.7102999999999999E-5,0.94642999999999999,3.1204000000000001,3.2970214384582062]
[48,145,705.34,5.7442999999999999E-5,0.94549000000000005,3.0920999999999998,3.2703677458249159]
[48,146,707.8,5.7778000000000001E-5,0.94457999999999998,3.0649000000000002,3.24472252217917]
[48,147,710.21,5.8108E-5,0.94369999999999998,3.0387,3.2199851647769417]
[48,148,712.56,5.8433000000000001E-5,0.94284000000000001,3.0135000000000001,3.1961944762632046]
[48,149,714.87,5.8752999999999998E-5,0.94201000000000001,2.9891000000000001,3.1731085657264786]
[48,150,717.14,5.9069E-5,0.94120000000000004,2.9657,3.1509774755631108]
[48,151,719.36,5.9380999999999999E-5,0.94040999999999997,2.9430000000000001,3.1294860752225095]
[48,152,721.53,5.9688999999999997E-5,0.93964999999999999,2.9211,3.1087106901505881]
[48,153,723.67,5.9991999999999998E-5,0.93889999999999996,2.8999000000000001,3.0886143359250191]
[48,154,725.77,6.0291999999999998E-5,0.93818000000000001,2.8795000000000002,3.0692404442644272]
[48,155,727.83,6.0588000000000003E-5,0.93747000000000003,2.8597000000000001,3.0504442808836552]
[48,156,729.86,6.0881000000000002E-5,0.93679000000000001,2.8405,{"$f":"F2243/E2243","v":3.0321630247974465}]
[48,157,731.85,6.1169999999999999E-5,0.93611999999999995,2.8218999999999999,3.0144639576122718]
[48,158,733.8,6.1455E-5,0.93547000000000002,2.8039000000000001,2.9973168567671866]
[48,159,735.73,6.1737999999999997E-5,0.93483000000000005,2.7864,2.9806488880331181]
[48,160,737.62,6.2016999999999999E-5,0.93422000000000005,2.7694000000000001,2.964398107512149]
[48,161,739.48,6.2292999999999995E-5,0.93361000000000005,2.7530000000000001,2.9487687578324997]
[48,162,741.31,6.2565999999999997E-5,0.93301999999999996,2.7370000000000001,2.9334848127585693]
[48,163,743.12,6.2836000000000006E-5,0.93245,2.7214,2.9185479114161619]
[48,164,744.9,6.3103999999999998E-5,0.93189,2.7063000000000001,2.9040981231690437]
[48,165,746.65,6.3368999999999996E-5,0.93135000000000001,2.6916000000000002,2.8899983894346919]
[48,166,748.37,6.3631000000000001E-5,0.93081000000000003,2.6772999999999998,2.8763120293078068]
[48,167,750.07,6.389E-5,0.93030000000000002,2.6634000000000002,2.8629474363108676]
[48,168,751.75,6.4146999999999994E-5,0.92979000000000001,2.6499000000000001,2.8499983867324881]
[48,169,753.4,6.4401999999999998E-5,0.92928999999999995,2.6366999999999998,2.8373274220103522]
[48,170,755.03,6.4653999999999995E-5,0.92881000000000002,2.6238000000000001,2.8249049859497637]
[48,171,756.63,6.4904000000000001E-5,0.92834000000000005,2.6113,2.8128702845940063]
[48,172,758.22,6.5152000000000002E-5,0.92788000000000004,2.5990000000000002,2.801008751131612]
[48,173,759.79,6.5396999999999997E-5,0.92742999999999998,2.5871,2.7895366766224945]
[48,174,761.33,6.5641000000000004E-5,0.92698999999999998,2.5754000000000001,2.7782392474568227]
[48,175,762.85,6.5882000000000004E-5,0.92656000000000005,2.5640999999999998,2.7673329304092555]
[48,176,764.36,6.6120999999999999E-5,0.92613999999999996,2.5529999999999999,2.7566026734618956]
[48,177,765.85,6.6359000000000006E-5,0.92574000000000001,2.5421,2.7460194006956598]
[48,178,767.32,6.6594000000000006E-5,0.92534000000000005,2.5314999999999999,2.7357511833488228]
[48,179,768.77,6.6827000000000002E-5,0.92495000000000005,2.5211000000000001,2.7256608465322452]
[48,180,770.2,6.7058999999999996E-5,0.92457,2.5110000000000001,2.7158571011389081]
[48,181,771.62,6.7288999999999999E-5,0.92418999999999996,2.5011000000000001,2.7062616994340991]
[48,182,773.02,6.7516999999999997E-5,0.92383000000000004,2.4914000000000001,2.6968165138607754]
[48,183,774.4,6.7743000000000005E-5,0.92347000000000001,2.4819,2.6875805386206375]
[48,184,775.77,6.7967999999999997E-5,0.92313000000000001,2.4725999999999999,2.6784959864807774]
[48,185,777.12,6.8190999999999998E-5,0.92279,2.4634999999999998,2.6696214740081707]
[48,186,778.46,6.8411999999999995E-5,0.92245999999999995,2.4546000000000001,2.6609283871387381]
[48,187,779.78,6.8632000000000003E-5,0.92213000000000001,2.4458000000000002,2.6523375229089177]
[48,188,781.09,6.8850000000000007E-5,0.92181000000000002,2.4373,2.6440372744925744]
[48,189,782.39,6.9066999999999994E-5,0.92149999999999999,2.4289000000000001,2.6358111774281063]
[48,190,783.67,6.9282000000000005E-5,0.92120000000000002,2.4207000000000001,2.627768128528007]
[48,191,784.94,6.9496E-5,0.92091000000000001,2.4125999999999999,2.6197999804541157]
[48,192,786.2,6.9709000000000006E-5,0.92061999999999999,2.4047000000000001,2.6120440572657557]
[48,193,787.44,6.9919999999999995E-5,0.92032999999999998,2.3969,2.6043919029043932]
[48,194,788.67,7.0129000000000006E-5,0.92005999999999999,2.3893,2.5968958546181771]
[48,195,789.89,7.0338000000000003E-5,0.91979,2.3818999999999999,2.5896128464105934]
[48,196,791.09,7.0544999999999996E-5,0.91952,2.3744999999999998,2.5823255611623455]
[48,197,792.29,7.0749999999999999E-5,0.91927000000000003,2.3673000000000002,2.5751955355880209]
[48,198,793.47,7.0955000000000001E-5,0.91900999999999999,2.3601999999999999,2.5681983873951317]
[48,199,794.64,7.1157999999999999E-5,0.91876999999999998,2.3532999999999999,2.5613592085070258]
[48,200,795.8,7.1359999999999994E-5,0.91852,2.3464999999999998,2.5546531376562296]
[49,74,191.87,1.9383999999999999E-5,0.88649999999999995,2.1661999999999999,2.4435420191765371]
[49,75,196.65,1.9525E-5,0.89161999999999997,2.2284000000000002,2.4992709898835828]
[49,76,201.57,1.9673999999999998E-5,0.89686999999999995,2.2949000000000002,2.5587877841827691]
[49,77,206.65,1.9831E-5,0.90225999999999995,2.3660000000000001,2.6223039921973714]
[49,78,211.89,1.9996E-5,0.90778999999999999,2.4420999999999999,2.6901596184139502]
[49,79,217.31,2.0171999999999999E-5,0.91346000000000005,2.5238,2.7629014954130446]
[49,80,222.91,2.0356999999999998E-5,0.91927999999999999,2.6116999999999999,2.8410277608563224]
[49,81,228.71,2.0554E-5,0.92523999999999995,2.7061999999999999,2.9248627383165449]
[49,82,234.73,2.0763000000000001E-5,0.93133999999999995,2.8081,3.015118002018597]
[49,83,240.98,2.0985999999999999E-5,0.93759000000000003,2.9180999999999999,3.1123412152433363]
[49,84,247.48,2.1223999999999999E-5,0.94398000000000004,3.0371000000000001,3.2173351130320555]
[49,85,254.25,2.1478E-5,0.95050999999999997,3.1659000000000002,3.3307382352631749]
[49,86,261.3,2.1749000000000001E-5,0.95714999999999995,3.3052999999999999,3.4532727367706211]
[49,87,268.66000000000003,2.2041000000000001E-5,0.96391000000000004,3.4565000000000001,3.5859156975236277]
[49,88,276.36,2.2354E-5,0.97075,3.6200999999999999,3.7291784702549573]
[49,89,284.41000000000003,2.2691999999999999E-5,0.97763999999999995,3.7972000000000001,3.8840472975737494]
[49,90,292.83999999999997,2.3056000000000001E-5,0.98456999999999995,3.9882,4.0507023370608488]
[49,91,301.68,2.3448999999999999E-5,0.99146999999999996,4.1936,4.22967916326263]
[49,92,310.95,2.3875000000000001E-5,0.99829000000000001,4.4131999999999998,4.42075949874285]
[49,93,320.67,2.4335999999999999E-5,1.0049999999999999,4.6463000000000001,{"$f":"F2307/E2307","v":4.623184079601991}]
[49,94,330.86,2.4836000000000001E-5,1.0114000000000001,4.8913000000000002,4.836167688352778]
[49,95,341.53,2.5377000000000001E-5,1.0175000000000001,5.1456999999999997,5.0571990171990162]
[49,96,352.68,2.5962E-5,1.0230999999999999,5.4058000000000002,5.2837454794252769]
[49,97,364.3,2.6594999999999999E-5,1.0282,5.6664000000000003,5.5109900797510214]
[49,98,376.37,2.7276000000000001E-5,1.0326,5.9207999999999998,5.7338756536897151]
[49,99,388.83,2.8005E-5,1.0361,6.1600999999999999,5.9454685841135024]
[49,100,401.63,2.8782999999999999E-5,1.0387999999999999,6.3731999999999998,6.1351559491721215]
[49,101,414.66,2.9604E-5,1.0405,6.5480999999999998,6.2932244113407014]
[49,102,427.81,3.0463999999999998E-5,1.0412999999999999,6.6733000000000002,6.408623835590129]
[49,103,440.93,3.1353999999999998E-5,1.0410999999999999,6.7409999999999997,6.4748823359907792]
[49,104,453.89,3.2264999999999997E-5,1.04,6.7495000000000003,6.4899038461538465]
[49,105,466.56,3.3188000000000001E-5,1.0381,6.7041000000000004,6.4580483575763417]
[49,106,478.86,3.4112000000000001E-5,1.0355000000000001,6.6231,6.3960405601158854]
[49,107,490.7,3.5031999999999999E-5,1.0324,6.5101000000000004,6.3057923285548245]
[49,108,502.05,3.5939999999999998E-5,1.0289999999999999,6.3723000000000001,6.1927113702623915]
[49,109,512.87,3.6831E-5,1.0253000000000001,6.2173999999999996,6.0639812737735284]
[49,110,523.15,3.7700000000000002E-5,1.0215000000000001,6.0522,5.9248164464023487]
[49,111,532.89,3.8544999999999998E-5,1.0177,5.8822000000000001,5.7798958435688315]
[49,112,542.11,3.9363999999999998E-5,1.0139,5.7118000000000002,5.633494427458329]
[49,113,550.83000000000004,4.0157000000000002E-5,1.0102,5.5444000000000004,5.4884181350227683]
[49,114,559.08000000000004,4.0921999999999999E-5,1.0065999999999999,5.3823999999999996,5.3471090800715277]
[49,115,566.88,4.1661E-5,1.0031000000000001,5.2274000000000003,5.2112451400657962]
[49,116,574.27,4.2373999999999998E-5,0.99970999999999999,5.0803000000000003,5.08177371437717]
[49,117,581.28,4.3062000000000002E-5,0.99648999999999999,4.9417,4.9591064636875437]
[49,118,587.92999999999995,4.3727000000000003E-5,0.99341000000000002,4.8113999999999999,4.843317462075075]
[49,119,594.26,4.4369999999999997E-5,0.99046999999999996,4.6894999999999998,4.7346209375347055]
[49,120,600.29,4.4990999999999997E-5,0.98767000000000005,4.5754000000000001,4.6325189587615299]
[49,121,606.04,4.5593000000000002E-5,0.98501000000000005,4.4687999999999999,4.5368067329265687]
[49,122,611.53,4.6176E-5,0.98248000000000002,4.3691000000000004,4.4470116440029317]
[49,123,616.79,4.6742000000000001E-5,0.98007,4.2759,4.3628516330466196]
[49,124,621.83000000000004,4.7290999999999998E-5,0.97777000000000003,4.1886000000000001,4.2838295304621745]
[49,125,626.66999999999996,4.7824000000000002E-5,0.97558999999999996,4.1067999999999998,4.2095552434936812]
[49,126,631.32000000000005,4.8343000000000001E-5,0.97352000000000005,4.03,4.1396170597419673]
[49,127,635.79999999999995,4.8847999999999997E-5,0.97153999999999996,3.9578000000000002,4.0737386005722875]
[49,128,640.11,4.9339999999999999E-5,0.96965000000000001,3.8898000000000001,4.0115505594802245]
[49,129,644.27,4.9820000000000001E-5,0.96784999999999999,3.8256000000000001,3.9526786175543731]
[49,130,648.29,5.0287999999999997E-5,0.96613000000000004,3.7650000000000001,3.8969910881558381]
[49,131,652.16999999999996,5.0745999999999998E-5,0.96448,3.7077,3.8442476775049768]
[49,132,655.93,5.1192E-5,0.96289999999999998,3.6534,3.7941634645342197]
[49,133,659.57,5.1629000000000003E-5,0.96138000000000001,3.6019000000000001,3.7465934385986812]
[49,134,663.1,5.2057E-5,0.95992999999999995,3.5529000000000002,3.7012073797047704]
[49,135,666.53,5.2475000000000002E-5,0.95852999999999999,3.5064000000000002,3.6581014678726804]
[49,136,669.86,5.2884999999999999E-5,0.95718999999999999,3.4620000000000002,3.6168367826659287]
[49,137,673.09,5.3287E-5,0.95589000000000002,3.4198,3.5776083022105052]
[49,138,676.24,5.3681000000000003E-5,0.95465,3.3794,3.5399361022364215]
[49,139,679.3,5.4067999999999998E-5,0.95343999999999995,3.3408000000000002,3.5039436147004537]
[49,140,682.29,5.4447999999999998E-5,0.95228000000000002,3.3039000000000001,3.4694627630528836]
[49,141,685.19,5.4821000000000002E-5,0.95116000000000001,3.2686000000000002,3.4364355103242357]
[49,142,688.03,5.5186999999999999E-5,0.95006999999999997,3.2347000000000001,3.4046964960476598]
[49,143,690.8,5.5547999999999997E-5,0.94901999999999997,3.2021999999999999,3.3742176139596638]
[49,144,693.51,5.5902000000000001E-5,0.94799999999999995,3.1711,3.345042194092827]
[49,145,696.15,5.6251000000000001E-5,0.94701999999999997,3.1410999999999998,3.3168254102342081]
[49,146,698.73,5.6594000000000001E-5,0.94606000000000001,3.1122999999999998,3.2897490645413607]
[49,147,701.26,5.6932000000000003E-5,0.94513000000000003,3.0844999999999998,3.2635722069979787]
[49,148,703.73,5.7265000000000001E-5,0.94423000000000001,3.0577999999999999,3.2384058968683473]
[49,149,706.16,5.7593000000000002E-5,0.94335999999999998,3.0320999999999998,3.2141494233378562]
[49,150,708.53,5.7915999999999999E-5,0.94250999999999996,3.0072999999999999,3.1907353768129783]
[49,151,710.85,5.8235000000000001E-5,0.94167999999999996,2.9832999999999998,3.1680613371846063]
[49,152,713.13,5.855E-5,0.94088000000000005,2.9601999999999999,3.1462035541195474]
[49,153,715.37,5.8860000000000002E-5,0.94010000000000005,2.9379,3.1250930752047652]
[49,154,717.56,5.9166000000000002E-5,0.93933999999999995,2.9163000000000001,3.104626652756191]
[49,155,719.71,5.9469000000000003E-5,0.93859999999999999,2.8954,3.0848071595994035]
[49,156,721.83,5.9766999999999999E-5,0.93788000000000005,2.8752,3.0656373949759028]
[49,157,723.9,6.0062000000000002E-5,0.93716999999999995,2.8555999999999999,{"$f":"F2371/E2371","v":3.0470458934878413}]
[49,158,725.94,6.0353999999999998E-5,0.93649000000000004,2.8365999999999998,3.0289698768806925]
[49,159,727.95,6.0640999999999998E-5,0.93581999999999999,2.8182,3.0114765660062832]
[49,160,729.92,6.0925999999999999E-5,0.93518000000000001,2.8003999999999998,2.9945037319018795]
[49,161,731.85,6.1206999999999999E-5,0.93454000000000004,2.7831000000000001,2.9780426734008176]
[49,162,733.76,6.1486000000000001E-5,0.93393000000000004,2.7663000000000002,2.9619992933089203]
[49,163,735.64,6.1760999999999994E-5,0.93332999999999999,2.7498999999999998,2.9463319511855399]
[49,164,737.49,6.2032999999999994E-5,0.93274000000000001,2.7341000000000002,2.9312562986469972]
[49,165,739.3,6.2303000000000003E-5,0.93217000000000005,2.7187000000000001,2.9165281010974393]
[49,166,741.1,6.2569000000000004E-5,0.93161000000000005,2.7037,2.9021800968216311]
[49,167,742.86,6.2833E-5,0.93106,2.6890999999999998,2.8882134341503232]
[49,168,744.6,6.3095000000000005E-5,0.93052999999999997,2.6749000000000001,2.8745983471784897]
[49,169,746.31,6.3353000000000001E-5,0.93001,2.661,2.8612595563488563]
[49,170,748,6.3609999999999996E-5,0.92950999999999995,2.6476000000000002,2.8483824810921887]
[49,171,749.67,6.3863999999999997E-5,0.92901,2.6343999999999999,2.8357068276983024]
[49,172,751.31,6.4115000000000005E-5,0.92852999999999997,2.6215999999999999,2.8233875049809916]
[49,173,752.93,6.4363999999999996E-5,0.92806,2.6092,2.8114561558519924]
[49,174,754.53,6.4611999999999997E-5,0.92759999999999998,2.597,2.7996981457524797]
[49,175,756.11,6.4856000000000004E-5,0.92715000000000003,2.5851000000000002,2.7882219705549263]
[49,176,757.66,6.5098999999999995E-5,0.92671000000000003,2.5735000000000001,2.7770284123404303]
[49,177,759.2,6.5339999999999994E-5,0.92627999999999999,2.5621999999999998,2.7661182363864056]
[49,178,760.72,6.5578000000000001E-5,0.92586000000000002,2.5510999999999999,2.7553841833538546]
[49,179,762.22,6.5815000000000006E-5,0.92544999999999999,2.5402999999999998,2.7449348965368197]
[49,180,763.7,6.6050000000000006E-5,0.92505000000000004,2.5297000000000001,2.7346629911896652]
[49,181,765.16,6.6283000000000002E-5,0.92466000000000004,2.5194000000000001,2.7246771786386348]
[49,182,766.61,6.6513999999999994E-5,0.92427999999999999,2.5093000000000001,2.7148699528281472]
[49,183,768.04,6.6742999999999994E-5,0.92390000000000005,2.4994000000000001,2.7052711332395281]
[49,184,769.45,6.6971000000000006E-5,0.92354000000000003,2.4897,2.6958225956645081]
[49,185,770.84,6.7195999999999998E-5,0.92318,2.4803000000000002,2.6866916527654414]
[49,186,772.22,6.7420000000000002E-5,0.92283000000000004,2.4710000000000001,2.6776329334763718]
[49,187,773.59,6.7643000000000003E-5,0.92249000000000003,2.4619,2.6687552168587194]
[49,188,774.94,6.7863999999999999E-5,0.92215999999999998,2.4529999999999998,2.6600589919319857]
[49,189,776.27,6.8083000000000005E-5,0.92183999999999999,2.4443000000000001,2.651544736613729]
[49,190,777.59,6.8300999999999995E-5,0.92152000000000001,2.4358,2.6432416008334054]
[49,191,778.9,6.8516999999999995E-5,0.92120999999999997,2.4274,2.6350126464106989]
[49,192,780.19,6.8732000000000005E-5,0.92090000000000005,2.4192,2.6269953306547942]
[49,193,781.47,6.8944999999999998E-5,0.92061000000000004,2.4112,2.6191329661854641]
[49,194,782.74,6.9157000000000002E-5,0.92032000000000003,2.4033000000000002,2.6113743045897082]
[49,195,783.99,6.9368000000000004E-5,0.92003000000000001,2.3955000000000002,2.6037194439311762]
[49,196,785.23,6.9577000000000001E-5,0.91976000000000002,2.3879000000000001,2.5962207532399759]
[49,197,786.46,6.9784999999999997E-5,0.91947999999999996,2.3803999999999998,2.5888545699743331]
[49,198,787.68,6.9991000000000001E-5,0.91922000000000004,2.3731,2.5816453079785036]
[49,199,788.88,7.0196000000000004E-5,0.91896,2.3658999999999999,2.5745407852354836]
[49,200,790.07,7.0400000000000004E-5,0.91871000000000003,2.3589000000000002,2.5676219917057614]
[50,74,189.31,1.9364E-5,0.88151000000000002,2.1088,2.3922587378475568]
[50,75,193.93,1.9499000000000001E-5,0.88636000000000004,2.1659000000000002,2.4435895121621014]
[50,76,198.69,1.9639999999999998E-5,0.89132,2.2265000000000001,2.4979805232688599]
[50,77,203.58,1.9789999999999999E-5,0.89639999999999997,2.2911999999999999,2.5560017849174477]
[50,78,208.62,1.9947000000000001E-5,0.90159999999999996,2.3601000000000001,2.6176796805678797]
[50,79,213.82,2.0112E-5,0.90693000000000001,2.4338000000000002,2.6835588193135083]
[50,80,219.18,2.0287000000000001E-5,0.91237999999999997,2.5125000000000002,2.7537867993599163]
[50,81,224.73,2.0472E-5,0.91796999999999995,2.5969000000000002,2.8289595520550783]
[50,82,230.46,2.0667999999999999E-5,0.92367999999999995,2.6873999999999998,2.9094491598822101]
[50,83,236.4,2.0876000000000001E-5,0.92952000000000001,2.7845,2.9956321542301403]
[50,84,242.56,2.1097000000000001E-5,0.93549000000000004,2.8889999999999998,3.0882211461373181]
[50,85,248.95,2.1331999999999998E-5,0.94157000000000002,3.0015000000000001,3.1877608674872819]
[50,86,255.59,2.1583E-5,0.94777,3.1225000000000001,3.2945756881943931]
[50,87,262.49,2.1849999999999999E-5,0.95406999999999997,3.2530000000000001,3.4096030689572046]
[50,88,269.68,2.2135999999999999E-5,0.96045000000000003,3.3935,3.5332396272580562]
[50,89,277.18,2.2442E-5,0.96689999999999998,3.5447000000000002,3.6660461267969802]
[50,90,285,2.2770999999999999E-5,0.97338000000000002,3.7071000000000001,3.8084817851198913]
[50,91,293.16000000000003,2.3124000000000001E-5,0.97987999999999997,3.8812000000000002,3.9608931705923176]
[50,92,301.69,2.3504000000000001E-5,0.98633999999999999,4.0670999999999999,4.1234259991483668]
[50,93,310.60000000000002,2.3913E-5,0.99272000000000005,4.2644000000000002,4.2956724957691996]
[50,94,319.91000000000003,2.4352999999999999E-5,0.99895999999999996,4.4724000000000004,{"$f":"F2435/E2435","v":4.4770561383839196}]
[50,95,329.63,2.4828E-5,1.0049999999999999,4.6897000000000002,4.666368159203981]
[50,96,339.77,2.5340000000000001E-5,1.0106999999999999,4.9141000000000004,4.8620757890570898]
[50,97,350.32,2.5890000000000001E-5,1.016,5.1426999999999996,5.0617125984251965]
[50,98,361.28,2.6480999999999999E-5,1.0207999999999999,5.3714000000000004,5.2619514106583081]
[50,99,372.63,2.7115E-5,1.0250999999999999,5.5952999999999999,5.4582967515364356]
[50,100,384.33,2.7790999999999999E-5,1.0286,5.8076999999999996,5.6462181606066499]
[50,101,396.32,2.8507999999999999E-5,1.0315000000000001,6.0011000000000001,5.8178380998545807]
[50,102,408.53,2.9266000000000001E-5,1.0335000000000001,6.1665999999999999,5.9667150459603286]
[50,103,420.88,3.0057999999999999E-5,1.0346,6.2957000000000001,6.0851536825826411]
[50,104,433.26,3.0880999999999998E-5,1.0349999999999999,6.3815,6.1657004830917881]
[50,105,445.55,3.1726000000000001E-5,1.0346,6.4202000000000004,6.2054900444616283]
[50,106,457.65,3.2586000000000003E-5,1.0334000000000001,6.4127000000000001,6.2054383588155595]
[50,107,469.47,3.3454000000000002E-5,1.0316000000000001,6.3651999999999997,6.1702210158976341]
[50,108,480.94,3.4322000000000001E-5,1.0293000000000001,6.2901999999999996,6.111143495579519]
[50,109,492.01,3.5185000000000003E-5,1.0265,6.1897000000000002,6.0299074525085246]
[50,110,502.64,3.6037000000000001E-5,1.0234000000000001,6.07,5.9312096931795972]
[50,111,512.80999999999995,3.6874E-5,1.0201,5.9367000000000001,5.8197235565140675]
[50,112,522.51,3.7693E-5,1.0166999999999999,5.7950999999999997,5.6999114783121865]
[50,113,531.74,3.8491999999999997E-5,1.0133000000000001,5.6492000000000004,5.5750518109148324]
[50,114,540.51,3.9267999999999997E-5,1.0099,5.5025000000000004,5.4485592632933955]
[50,115,548.84,4.0021000000000002E-5,1.0065999999999999,5.3574999999999999,5.3223723425392411]
[50,116,556.76,4.0751999999999999E-5,1.0033000000000001,5.2161999999999997,5.1990431575799851]
[50,117,564.28,4.1458999999999997E-5,1.0001,5.0799000000000003,5.0793920607939214]
[50,118,571.42999999999995,4.2144000000000002E-5,0.99707999999999997,4.9494999999999996,4.9639948650058168]
[50,119,578.23,4.2806999999999999E-5,0.99412999999999996,4.8254999999999999,4.8539929385492844]
[50,120,584.71,4.3448999999999997E-5,0.99129,4.7081,4.749467865105065]
[50,121,590.89,4.4070999999999999E-5,0.98856999999999995,4.5972999999999997,4.6504546971888692]
[50,122,596.79,4.4675000000000002E-5,0.98597000000000001,4.4928999999999997,4.5568323579824943]
[50,123,602.44000000000005,4.5259999999999997E-5,0.98346999999999996,4.3948,4.468667066611081]
[50,124,607.85,4.5828000000000002E-5,0.98109000000000002,4.3025000000000002,4.3854284520278464]
[50,125,613.03,4.638E-5,0.97880999999999996,4.2157999999999998,4.307066744311971]
[50,126,618.01,4.6916999999999998E-5,0.97663,4.1341999999999999,4.2331282061783888]
[50,127,622.79,4.744E-5,0.97453999999999996,4.0572999999999997,4.1632975557699012]
[50,128,627.4,4.7948000000000002E-5,0.97255000000000003,3.9849999999999999,4.0974757081898101]
[50,129,631.84,4.8443999999999999E-5,0.97065000000000001,3.9167000000000001,4.0351310977180237]
[50,130,636.12,4.8928000000000003E-5,0.96882999999999997,3.8521999999999998,3.9761361642393402]
[50,131,640.25,4.9400000000000001E-5,0.96709000000000001,3.7911999999999999,3.9202142510004236]
[50,132,644.25,4.9861000000000003E-5,0.96540999999999999,3.7334000000000001,3.867165245854093]
[50,133,648.12,5.0311E-5,0.96380999999999994,3.6787000000000001,3.8168311181664438]
[50,134,651.87,5.0751999999999998E-5,0.96226999999999996,3.6267,3.7689006204079938]
[50,135,655.5,5.1183000000000001E-5,0.96079000000000003,3.5771999999999999,3.7231861280820988]
[50,136,659.03,5.1606E-5,0.95936999999999995,3.5301999999999998,3.6797064740402554]
[50,137,662.45,5.2018999999999998E-5,0.95799999999999996,3.4853999999999998,3.6382045929018787]
[50,138,665.78,5.2425E-5,0.95667999999999997,3.4426000000000001,3.5984864322448469]
[50,139,669.02,5.2822999999999999E-5,0.95540999999999998,3.4016999999999999,3.5604609539360066]
[50,140,672.17,5.3213E-5,0.95418000000000003,3.3626999999999998,3.5241778280827512]
[50,141,675.23,5.3596E-5,0.95299999999999996,3.3252999999999999,3.4892969569779644]
[50,142,678.23,5.3971999999999998E-5,0.95184999999999997,3.2894999999999999,3.4559016651783367]
[50,143,681.14,5.4342000000000002E-5,0.95074000000000003,3.2551999999999999,3.4238593095904242]
[50,144,683.99,5.4706000000000001E-5,0.94967000000000001,3.2222,3.3929680836501102]
[50,145,686.77,5.5062999999999998E-5,0.94862999999999997,3.1905999999999999,3.3633766589713585]
[50,146,689.48,5.5414999999999997E-5,0.94762000000000002,3.1602000000000001,3.3348810704712859]
[50,147,692.13,5.5760999999999997E-5,0.94664000000000004,3.1309,3.3073818980816361]
[50,148,694.73,5.6101999999999999E-5,0.94569999999999999,3.1027999999999998,3.2809559056783333]
[50,149,697.27,5.6437999999999997E-5,0.94477999999999995,3.0756000000000001,3.2553610364317622]
[50,150,699.75,5.6768999999999998E-5,0.94388000000000005,3.0495000000000001,3.2308132389710558]
[50,151,702.19,5.7095000000000001E-5,0.94301000000000001,3.0243000000000002,3.2070709748571065]
[50,152,704.57,5.7417000000000003E-5,0.94216999999999995,2.9998999999999998,3.1840326055807338]
[50,153,706.91,5.7734E-5,0.94135000000000002,2.9763999999999999,3.1618420353747276]
[50,154,709.2,5.8047000000000002E-5,0.94055,2.9537,3.1403965764712138]
[50,155,711.45,5.8356000000000002E-5,0.93976999999999999,2.9317000000000002,3.1195930919267481]
[50,156,713.65,5.8659999999999997E-5,0.93901999999999997,2.9104000000000001,3.0994015036953422]
[50,157,715.82,5.8961E-5,0.93828,2.8898000000000001,3.0798908641343736]
[50,158,717.95,5.9258000000000001E-5,0.93757000000000001,2.8698999999999999,{"$f":"F2499/E2499","v":3.0609981121409602}]
[50,159,720.04,5.9552000000000002E-5,0.93686999999999998,2.8506,3.0426846841077206]
[50,160,722.09,5.9842000000000001E-5,0.93618999999999997,2.8319000000000001,3.024920155096722]
[50,161,724.11,6.0129E-5,0.93552000000000002,2.8136999999999999,3.0076321190354025]
[50,162,726.09,6.0411999999999997E-5,0.93488000000000004,2.7961,2.9908651377716926]
[50,163,728.04,6.0693000000000003E-5,0.93425000000000002,2.7789000000000001,2.9744715012041745]
[50,164,729.96,6.0970000000000001E-5,0.93362999999999996,2.7623000000000002,2.958666709510192]
[50,165,731.85,6.1243999999999998E-5,0.93303000000000003,2.7462,2.943313719816083]
[50,166,733.71,6.1514999999999996E-5,0.93244000000000005,2.7305000000000001,2.9283385526146453]
[50,167,735.55,6.1784000000000003E-5,0.93186999999999998,2.7151999999999998,2.9137111399658751]
[50,168,737.35,6.2049000000000002E-5,0.93132000000000004,2.7002999999999999,2.8994330627496456]
[50,169,739.13,6.2311999999999996E-5,0.93076999999999999,2.6858,2.8855678631670552]
[50,170,740.88,6.2572999999999999E-5,0.93023999999999996,2.6718000000000002,2.8721620227038187]
[50,171,742.6,6.2830999999999995E-5,0.92971999999999999,2.6579999999999999,2.8589252678225701]
[50,172,744.31,6.3085999999999999E-5,0.92922000000000005,2.6446999999999998,2.8461505348571916]
[50,173,745.98,6.3338999999999998E-5,0.92871999999999999,2.6316000000000002,2.8335773968472737]
[50,174,747.64,6.3590000000000006E-5,0.92823999999999995,2.6189,2.8213608549513061]
[50,175,749.27,6.3838999999999996E-5,0.92776999999999998,2.6065,2.80942474966856]
[50,176,750.88,6.4084999999999994E-5,0.92730999999999997,2.5943999999999998,2.7977698935631019]
[50,177,752.47,6.4329E-5,0.92686000000000002,2.5825999999999998,2.7863970826230497]
[50,178,754.04,6.4571000000000002E-5,0.92642000000000002,2.5710999999999999,2.7753070961335031]
[50,179,755.59,6.4811E-5,0.92598999999999998,2.5598000000000001,2.7643927040248815]
[50,180,757.12,6.5048999999999993E-5,0.92557,2.5488,2.7537625463228066]
[50,181,758.63,6.5284999999999996E-5,0.92515999999999998,2.5379999999999998,2.7433092654243589]
[50,182,760.13,6.5518999999999994E-5,0.92476000000000003,2.5274999999999999,2.7331415718672951]
[50,183,761.6,6.5751000000000001E-5,0.92437000000000002,2.5171999999999999,2.7231519845949133]
[50,184,763.06,6.5982000000000006E-5,0.92398000000000002,2.5072000000000001,2.7134786467239551]
[50,185,764.5,6.6210000000000005E-5,0.92361000000000004,2.4973000000000001,2.7038468617706606]
[50,186,765.92,6.6437000000000001E-5,0.92325000000000002,2.4876999999999998,2.694503113999458]
[50,187,767.33,6.6662000000000007E-5,0.92288999999999999,2.4782999999999999,2.6853687871794039]
[50,188,768.72,6.6885999999999996E-5,0.92254000000000003,2.4689999999999999,2.6763067184078735]
[50,189,770.09,6.7107999999999995E-5,0.92220000000000002,2.46,2.6675341574495768]
[50,190,771.45,6.7328000000000003E-5,0.92186999999999997,2.4510999999999998,2.6588347597817479]
[50,191,772.8,6.7546999999999996E-5,0.92154000000000003,2.4424000000000001,2.6503461596892159]
[50,192,774.13,6.7763999999999997E-5,0.92122000000000004,2.4339,2.6420399036060873]
[50,193,775.45,6.7979999999999996E-5,0.92091000000000001,2.4256000000000002,2.6339164522048844]
[50,194,776.75,6.8194000000000005E-5,0.92061000000000004,2.4174000000000002,2.6258676312445011]
[50,195,778.04,6.8406999999999997E-5,0.92030999999999996,2.4094000000000002,2.6180308808988277]
[50,196,779.31,6.8617999999999999E-5,0.92001999999999995,2.4015,2.6102693419708269]
[50,197,780.58,6.8827999999999999E-5,0.91973000000000005,2.3938000000000001,2.6027203635849654]
[50,198,781.83,6.9036999999999996E-5,0.91944999999999999,2.3862000000000001,2.5952471586274406]
[50,199,783.07,6.9244000000000003E-5,0.91918,2.3788,2.5879588328727778]
[50,200,784.29,6.9449999999999994E-5,0.91891999999999996,2.3714,2.5806381404257173]

{"sheet":"Dados de Entrada","index":2,"n_rows":100,"n_cols":3,"rows_kept":100,"cut":false,"hidden":false,"merged":[[94,0,94,2],[67,0,67,2],[82,0,82,2],[85,0,85,2],[30,0,30,2],[40,0,40,2],[46,0,46,2],[51,0,51,2],[62,0,62,2],[57,0,57,2],[35,0,35,2],[1,0,1,2],[21,0,21,2],[16,0,16,2],[26,0,26,2],[24,0,24,2],[12,0,12,2]]}
["Variável","Valor","Unidade"]
["Tipo de Cálculo do Modelo"]
["Tipo de Hidrogênio","Musgo","\"Musgo com CCS\" ou \"Musgo\""]
["Tipo de cálculo","Cálculo Individual","\"Análise de Sensibilidade\" ou \"Cálculo Individual\""]
["Variável 1 da análise de Sensibilidade","Custo da Tonelada de Carbono"]
["Valor Inicial",0,{"$f":"VLOOKUP($B$5,$A:$C,3,0)","v":"US$/Toneladas de CO2eq"}]
["Valor Final",100,{"$f":"VLOOKUP($B$5,$A:$C,3,0)","v":"US$/Toneladas de CO2eq"}]
["Espaçamento entre os valores",10,{"$f":"VLOOKUP($B$5,$A:$C,3,0)","v":"US$/Toneladas de CO2eq"}]
["Variável 2 da análise de Sensibilidade","Custo do Etanol"]
["Valor Inicial",0.1,{"$f":"VLOOKUP($B$9,$A:$C,3,0)","v":"US$/Litro"}]
["Valor Final",1,{"$f":"VLOOKUP($B$9,$A:$C,3,0)","v":"US$/Litro"}]
["Espaçamento entre os valores",0.1,{"$f":"VLOOKUP($B$9,$A:$C,3,0)","v":"US$/Litro"}]
["Unidade do Preço do Hidrogênio"]
["Unidade Monetária","Dólares","\"Reais\" ou \"Dólares\""]
["Taxa de Câmbio",5.5,"R$/US$"]
["Unidade Volumétrica do Hidrogênio","kg","\"kg\" ou \"MMBtu\" ou \"m³ eq. de Gás Natural\" ou \"Litro eq. de Etanol\" ou \"Litro eq. de Diesel\" ou \"kg eq. de GLP\" ou \"kg eq. de Óleo Combustível\""]
["Vida Útil do Projeto"]
["Ano de Início do projeto",2026,"ano"]
["PerÍodo de Investimento",2,"número de anos"]
["Período de operação",20,"número de anos"]
["Ano Final do Fluxo de caixa",{"$f":"B18+B19+B20-1","v":2047},{"$f":"\"Maximo possivel\"&\" \"&B18+40-1","v":"Maximo possivel 2065"}]
["Imposto de Renda"]
["Imposto de Renda de Pessoa Juridica",0,"percentual"]
["Contribuição Social sobre Lucro Líquido",0,"percentual"]
["Remuneração do Capital"]
["Custo Médio Ponderado de Capital (WACC)",0.1,"percentual"]
["Produção de Hidrogênio"]
["Capacidade instalada de Produção de Hidrogênio",900,"Toneladas de H2 por ano"]
["Utilização da capacidade instalada (fator de operação médio)",0.9,"percentual"]
["Produção efetiva de Hidrogênio",{"$f":"B28*B29","v":810},"Toneladas de H2 por ano"]
["CAPEX do Sistema de Reforma a Vapor do Etanol"]
["Tipo de Capex utilizado no modelo","Capex Sugerido pelo Modelo","\"Capex Sugerido pelo Modelo\" ou \"Capex inserido pelo Usuário\""]
["Capex Sugerido pelo Modelo",{"$f":"(38314*($B$28)^0.7678)","v":7105994.9358564969},"US$"]
["Capex Inserido Manualmente pelo Usuário (Reforma a Vapor do Etanol)",0,"US$"]
["Capex utilizado no modelo",{"$f":"IF(B32=\"Capex inserido pelo Usuário\",B34,B33)","v":7105994.9358564969},"US$"]
["Custo dos Principais Insumos"]
["Custo do Gás Natural",0.307,"US$/m³"]
["Custo da Energia Elétrica",3.4000000000000002E-2,"US$/kWh"]
["Custo da Água",1E-3,"US$/Litro"]
["Custo do Etanol",0.55400000000000005,"US$/Litro"]
["OPEX do Sistema de Reforma a Vapor do Etanol"]
["Consumo Específico de Energia Elétrica do sistema de Reforma a Vapor",2.35,"kWh/kg H2"]
["Consumo Específico de Água do sistema de Reforma a Vapor",30,"Litro/kg H2"]
["Consumo Específico de Etanol do sistema de Reforma a Vapor",7.65,"Litro Etanol/kg H2"]
["Outros custos operacionais do sistema de Reforma a Vapor do Etanol",0.04,"Percentual do Capex"]
["OPEX total do sistema de Reforma a Vapor do Etanol",{"$f":"(B30*10^3)*SUMPRODUCT(B42:B44,B38:B40)+B35*B45","v":3806119.7974342601},"US$ por ano"]
["Custo do Carbono"]
["Custo da Tonelada de Carbono",9.09,"US$/Toneladas de CO2eq"]
["Combustível a ser substituido","Gás Natural","\"Gás Natural\" ou \"Óleo combustível\" ou \"GLP\" ou \"Diesel B (B15)\" ou \"Eletricidade\""]
["Imposto incidente sobre as receitas com a venda de créditos de carbono",0.15,"percentual"]
["Receitas com a venda de créditos de carbono",{"$f":"(VLOOKUP($B$49,Premissas!$A$2:$J$9,8,0)-Premissas!$I$3)/10^6*(Premissas!E3*Premissas!D14/10^3)*(B30*10^3)*B48","v":21534.756977424589},"US$ por ano"]
["Capacidade de Captura de Carbono"]
["CO2 dísponivel para Captura",{"$f":"$B$30*$B$44*Premissas!$E$4*Premissas!$D$14*(Premissas!$G$4+Premissas!$H$4)/10^6","v":9516.2460583626435},"Toneladas de CO2eq por ano"]
["Meta de Captura de CO2",0,"percentual"]
["Capacidade instalada de Captura de CO2",{"$f":"B53*B54","v":0},"Toneladas de CO2eq por ano"]
["Capacidade de utilização da Captura de CO2",0.95,"percentual"]
["Captura Efetiva de CO2",{"$f":"B55*B56","v":0},"Toneladas de CO2eq por ano"]
["CAPEX do Sistema de Captura de Carbono"]
["Tipo de CAPEX do sistema de Captura de Carbono utilizado no modelo","Capex Sugerido pelo Modelo","\"Capex Sugerido pelo Modelo\" ou \"Capex inserido pelo Usuário\""]
["CAPEX do sistema de Captura de Carbono Sugerido pelo Modelo",{"$f":"(238836*($B$55)^0.6)","v":0},"US$"]
["Capex Inserido Manualmente pelo Usuário (Captura de Carbono)",0,"US$"]
["CAPEX do sistema de Captura de Carbono utilizado no modelo",{"$f":"IF(B59=\"Capex inserido pelo Usuário\",B61,B60)","v":0},"US$"]
["OPEX do Sistema de Captura de Carbono"]
["Consumo Específico de Gás Natural do sistema de Captura de Carbono",35.31,"m³ GN/Toneladas de CO2eq"]
["Consumo Específico de Energia Elétrica do sistema de Captura de Carbono",155,"kWh/Toneladas de CO2eq"]
["Outros custos operacionais do sistema de Captura de Carbono",2.5000000000000001E-2,"Percentual do Capex do CCS"]
["OPEX total do sistema de Captura de Carbono",{"$f":"(B57)*SUMPRODUCT(B64:B65,B37:B38)+B62*B66","v":0},"US$"]
["Transporte de CO2"]
["Gradiente de perda de pressão do duto",0.1,"Bars/km"]
["Pressão final do duto no ponto de saída",100,{"$f":"_xlfn.CONCAT(\"Bars (Pressão deve estar entre \",Premissas!B50-B69*B73/2,\" e \",Premissas!B55-B69*B73,\" Bars)\")","v":"Bars (Pressão deve estar entre 68 e 188 Bars)"}]
["Pressão inicial do duto no ponto de entrada",{"$f":"B70+B69*B73","v":112},"Bars"]
["Pressão média de operação do Duto",{"$f":"ROUND(B70+(B69*B73/2),0)","v":106},"Bars"]
["Distância do Gasoduto",120,{"$f":"_xlfn.CONCAT(\"km (Distância máxima permitida de \",(Premissas!B55-B70)/B69,\" km)\")","v":"km (Distância máxima permitida de 1000 km)"}]
["Temperatura média de operação do gasoduto",31,"Celsus"]
["Diferença de elevação (cotas) entre os pontos de entrada e saída",0,"Metros"]
["Comprimento equivalente de perdas de carga localizadas",0,"Metros"]
["Diametro do gasoduto recomendado",{"$f":"(Premissas!B54*(\n     (B55*10^3/Premissas!$B$41/365/24/60/60)    /\n\n                (Premissas!B31*Premissas!B32*Premissas!B33*Premissas!B49/(Premissas!B50*10^5)*\n\n                ((((B71^2-B70^2)*10^10)-((((Premissas!$B$42/Premissas!$B$47)*($B$72*10^5)^2)/((($B$72*10^5*Premissas!B42)/(Premissas!B46*Premissas!B49*\n\n\n(SUMIFS('Densidade e Viscosidade do CO2'!$C:$C,'Densidade e Viscosidade do CO2'!$A:$A,$B$74,'Densidade e Viscosidade do CO2'!$B:$B,$B$72))))\n\n\n*Premissas!B48*(B74+273.15)))*2*Premissas!B51*(B75)))/((((Premissas!$B$42/Premissas!$B$47)^Premissas!B34)*(B73*10^3+B76)*(($B$72*10^5*Premissas!B42)/(Premissas!B46*Premissas!B49*\n\n(SUMIFS('Densidade e Viscosidade do CO2'!$C:$C,'Densidade e Viscosidade do CO2'!$A:$A,$B$74,'Densidade e Viscosidade do CO2'!$B:$B,$B$72))\n\n))*(B74+273.15))))\n                                                                                                                                                                                            ^Premissas!B35)\n\n                                                                                                                                                                                                                                 )^(1/Premissas!B36))","v":0},"Polegadas"]
["Diametro do gasoduto utilizado",{"$f":"EVEN(B77)","v":0},"Polegadas"]
["Velocidade do fluido",{"$f":"(4*\n\n((B55*10^3/365/24/60/60)/\n\n(SUMIFS('Densidade e Viscosidade do CO2'!$C:$C,'Densidade e Viscosidade do CO2'!$A:$A,$B$74,'Densidade e Viscosidade do CO2'!$B:$B,$B$72))))\n\n\n/(PI()*((B78/Premissas!B54)^2))","v":{"$error":"#DIV/0!"}},"m/s"]
["Velocidade de erosao",{"$f":"(120/SQRT(SUMIFS('Densidade e Viscosidade do CO2'!$C:$C,'Densidade e Viscosidade do CO2'!$A:$A,$B$74,'Densidade e Viscosidade do CO2'!$B:$B,$B$72)))","v":4.3106106806244755},"m/s"]
["Validação da Velocidade do fluido",{"$f":"B79/B80","v":{"$error":"#DIV/0!"}},{"$f":"IF(B81<=50%,_xlfn.CONCAT(\"Validado: a velocidade do fluido é \",ROUND(B81*100,2),\"% da velocidade de erosão, estando dentro da faixa recomendada (limite ≤ 50%, alvo ≤ 40%)\"),_xlfn.CONCAT(\"Atenção risco de erosão: a velocidade do fluido é \",ROUND(B81*100,2),\"% da velocidade de erosão, estando acima do limite de 50%\"))","v":{"$error":"#DIV/0!"}}]
["Reynolds (Re)",{"$f":"((SUMIFS('Densidade e Viscosidade do CO2'!$C:$C,'Densidade e Viscosidade do CO2'!$A:$A,$B$74,'Densidade e Viscosidade do CO2'!$B:$B,$B$72))*B79*(B78/Premissas!B54))/(SUMIFS('Densidade e Viscosidade do CO2'!$D:$D,'Densidade e Viscosidade do CO2'!$A:$A,$B$74,'Densidade e Viscosidade do CO2'!$B:$B,$B$72))","v":{"$error":"#DIV/0!"}},{"$f":"IF(AND(B82>=IF(Premissas!C29=\"Panhandle-B\",4,0.04)*10^6,B82<=IF(Premissas!C29=\"Panhandle-B\",40,10^10)*10^6),_xlfn.CONCAT(Premissas!$C$29,\" validado: Re = \",ROUND(B82/10^6,2),\"×10^6 está dentro da faixa recomendada (\",IF(Premissas!C29=\"Panhandle-B\",\"entre 4 e 40 ×10^6)\",\"maior do que 0,04 ×10^6)\")),_xlfn.CONCAT(\"Atenção: Re = \",ROUND(B82/10^6,2),\"×10^6 está fora da faixa recomendada (\",,IF(Premissas!C29=\"Panhandle-B\",\"entre 4 e 40 ×10^6)\",\"maior do que 0,04 ×10^6)\"),\", podendo tornar o modelo \",Premissas!$C$29,\" inadequado para representar o escoamento\"))","v":{"$error":"#DIV/0!"}}]
["CAPEX do Gasoduto de CO2"]
["Custo do duto por metro-polegada",100,"US$/(metro.pol)"]
["Capex do total do Gasoduto",{"$f":"B78*B84*(B73*10^3)","v":0},"US$"]
["OPEX do Gasoduto de CO2"]
["Pressão disponível do CO2 a montante do ponto de entrada do Gasoduto",60,{"$f":"_xlfn.CONCAT(\"Bars (Pressão máxima permitida de \",B71,\" Bars)\")","v":"Bars (Pressão máxima permitida de 112 Bars)"}]
["Potência teórica do compressor",{"$f":"MAX(0,\n\n (B57*10^3/365/24/60/60/Premissas!B42)*\n\n           ((($B$72*10^5*Premissas!B42)/(Premissas!B46*Premissas!B49*\n\n(SUMIFS('Densidade e Viscosidade do CO2'!$C:$C,'Densidade e Viscosidade do CO2'!$A:$A,$B$74,'Densidade e Viscosidade do CO2'!$B:$B,$B$72)))))*\n\n          Premissas!B46*(273.15+B74)*      Premissas!B53*         (Premissas!B52/(Premissas!B52-1))    *     ((B71/B87)^((Premissas!B52-1)/(Premissas!B52*Premissas!B53))-1)\n\n                                                     /10^3\n\n)","v":0},"kW"]
["Rendimento energético de compresssão a eletricidade",0.85,"Percentual"]
["Consumo anual de energia do compressor",{"$f":"B88*365*24/B89","v":0},"kWh/ano"]
["Custo operacional do compressor",{"$f":"B90*B38","v":0},"US$ por ano"]
["Outros custos operacionais do Gasoduto por percentual do Capex",0.01,"Percentual do Capex"]
["Outros custos operacionais do Gasoduto",{"$f":"B85*B92","v":0},"US$ por ano"]
["OPEX total do Gasoduto",{"$f":"B91+B93","v":0},"US$ por ano"]
["Estocagem de CO2"]
["Capacidade de Estocagem necessária para a vida útil do projeto",{"$f":"MIN(MAX($B$57*$B$20/10^6,15),200)","v":15},"Milhões de Toneladas de CO2eq (limitado entre 15 e 200 Mt de CO2)"]
["Localização da Estocagem","Terra","\"Terra\" ou \"Mar\""]
["Tipo de Formação Geológica","Campo Depletado de Óleo e Gás","\"Campo Depletado de Óleo e Gás\" ou \"Aquífero Salino\""]
["Infraestrutura Prévia","Com poços legados","\"Com poços legados\" ou \"Sem poços legados\""]
["Custo adicional de break-even da Estocagem de CO2",{"$f":"IFERROR(_xlfn.IFS(AND($B$97=\"Terra\",$B$98=\"Campo Depletado de Óleo e Gás\",$B$99=\"Com poços legados\"),715.0548*$B$96^-1.1729,\n         AND($B$97=\"Terra\",$B$98=\"Campo Depletado de Óleo e Gás\",$B$99=\"Sem poços legados\"),2411.6869*$B$96^-1.4008,\n         AND($B$97=\"Mar\",$B$98=\"Campo Depletado de Óleo e Gás\",$B$99=\"Com poços legados\"),451.2798*$B$96^-0.9439,\n         AND($B$97=\"Mar\",$B$98=\"Campo Depletado de Óleo e Gás\",$B$99=\"Sem poços legados\"),826.1094*$B$96^-0.9785,\n         AND($B$97=\"Terra\",$B$98=\"Aquífero Salino\"),798.4847*$B$96^-1.0658,\n         AND($B$97=\"Mar\",$B$98=\"Aquífero Salino\"),482.3333*$B$96^-0.7507),0)\n\n*($B$57/($B$30*10^3))","v":0},"US$ por kg de H2"]

{"sheet":"Fluxo de Caixa","index":3,"n_rows":64,"n_cols":41,"rows_kept":64,"cut":false,"hidden":false,"merged":[[44,6,44,8],[45,6,45,8],[37,3,37,6]]}
["Fluxo de Caixa em Dólares",{"$f":"'Dados de Entrada'!$B$18","v":2026},{"$f":"IFERROR(IF(B$1+1<'Dados de Entrada'!$B$18+'Dados de Entrada'!$B$20+'Dados de Entrada'!$B$19,B$1+1,\"\"),\"\")","v":2027},{"$f":"IFERROR(IF(C$1+1<'Dados de Entrada'!$B$18+'Dados de Entrada'!$B$20+'Dados de Entrada'!$B$19,C$1+1,\"\"),\"\")","v":2028},{"$f":"IFERROR(IF(D$1+1<'Dados de Entrada'!$B$18+'Dados de Entrada'!$B$20+'Dados de Entrada'!$B$19,D$1+1,\"\"),\"\")","v":2029},{"$f":"IFERROR(IF(E$1+1<'Dados de Entrada'!$B$18+'Dados de Entrada'!$B$20+'Dados de Entrada'!$B$19,E$1+1,\"\"),\"\")","v":2030},{"$f":"IFERROR(IF(F$1+1<'Dados de Entrada'!$B$18+'Dados de Entrada'!$B$20+'Dados de Entrada'!$B$19,F$1+1,\"\"),\"\")","v":2031},{"$f":"IFERROR(IF(G$1+1<'Dados de Entrada'!$B$18+'Dados de Entrada'!$B$20+'Dados de Entrada'!$B$19,G$1+1,\"\"),\"\")","v":2032},{"$f":"IFERROR(IF(H$1+1<'Dados de Entrada'!$B$18+'Dados de Entrada'!$B$20+'Dados de Entrada'!$B$19,H$1+1,\"\"),\"\")","v":2033},{"$f":"IFERROR(IF(I$1+1<'Dados de Entrada'!$B$18+'Dados de Entrada'!$B$20+'Dados de Entrada'!$B$19,I$1+1,\"\"),\"\")","v":2034},{"$f":"IFERROR(IF(J$1+1<'Dados de Entrada'!$B$18+'Dados de Entrada'!$B$20+'Dados de Entrada'!$B$19,J$1+1,\"\"),\"\")","v":2035},{"$f":"IFERROR(IF(K$1+1<'Dados de Entrada'!$B$18+'Dados de Entrada'!$B$20+'Dados de Entrada'!$B$19,K$1+1,\"\"),\"\")","v":2036},{"$f":"IFERROR(IF(L$1+1<'Dados de Entrada'!$B$18+'Dados de Entrada'!$B$20+'Dados de Entrada'!$B$19,L$1+1,\"\"),\"\")","v":2037},{"$f":"IFERROR(IF(M$1+1<'Dados de Entrada'!$B$18+'Dados de Entrada'!$B$20+'Dados de Entrada'!$B$19,M$1+1,\"\"),\"\")","v":2038},{"$f":"IFERROR(IF(N$1+1<'Dados de Entrada'!$B$18+'Dados de Entrada'!$B$20+'Dados de Entrada'!$B$19,N$1+1,\"\"),\"\")","v":2039},{"$f":"IFERROR(IF(O$1+1<'Dados de Entrada'!$B$18+'Dados de Entrada'!$B$20+'Dados de Entrada'!$B$19,O$1+1,\"\"),\"\")","v":2040},{"$f":"IFERROR(IF(P$1+1<'Dados de Entrada'!$B$18+'Dados de Entrada'!$B$20+'Dados de Entrada'!$B$19,P$1+1,\"\"),\"\")","v":2041},{"$f":"IFERROR(IF(Q$1+1<'Dados de Entrada'!$B$18+'Dados de Entrada'!$B$20+'Dados de Entrada'!$B$19,Q$1+1,\"\"),\"\")","v":2042},{"$f":"IFERROR(IF(R$1+1<'Dados de Entrada'!$B$18+'Dados de Entrada'!$B$20+'Dados de Entrada'!$B$19,R$1+1,\"\"),\"\")","v":2043},{"$f":"IFERROR(IF(S$1+1<'Dados de Entrada'!$B$18+'Dados de Entrada'!$B$20+'Dados de Entrada'!$B$19,S$1+1,\"\"),\"\")","v":2044},{"$f":"IFERROR(IF(T$1+1<'Dados de Entrada'!$B$18+'Dados de Entrada'!$B$20+'Dados de Entrada'!$B$19,T$1+1,\"\"),\"\")","v":2045},{"$f":"IFERROR(IF(U$1+1<'Dados de Entrada'!$B$18+'Dados de Entrada'!$B$20+'Dados de Entrada'!$B$19,U$1+1,\"\"),\"\")","v":2046},{"$f":"IFERROR(IF(V$1+1<'Dados de Entrada'!$B$18+'Dados de Entrada'!$B$20+'Dados de Entrada'!$B$19,V$1+1,\"\"),\"\")","v":2047},{"$f":"IFERROR(IF(W$1+1<'Dados de Entrada'!$B$18+'Dados de Entrada'!$B$20+'Dados de Entrada'!$B$19,W$1+1,\"\"),\"\")","v":""},{"$f":"IFERROR(IF(X$1+1<'Dados de Entrada'!$B$18+'Dados de Entrada'!$B$20+'Dados de Entrada'!$B$19,X$1+1,\"\"),\"\")","v":""},{"$f":"IFERROR(IF(Y$1+1<'Dados de Entrada'!$B$18+'Dados de Entrada'!$B$20+'Dados de Entrada'!$B$19,Y$1+1,\"\"),\"\")","v":""},{"$f":"IFERROR(IF(Z$1+1<'Dados de Entrada'!$B$18+'Dados de Entrada'!$B$20+'Dados de Entrada'!$B$19,Z$1+1,\"\"),\"\")","v":""},{"$f":"IFERROR(IF(AA$1+1<'Dados de Entrada'!$B$18+'Dados de Entrada'!$B$20+'Dados de Entrada'!$B$19,AA$1+1,\"\"),\"\")","v":""},{"$f":"IFERROR(IF(AB$1+1<'Dados de Entrada'!$B$18+'Dados de Entrada'!$B$20+'Dados de Entrada'!$B$19,AB$1+1,\"\"),\"\")","v":""},{"$f":"IFERROR(IF(AC$1+1<'Dados de Entrada'!$B$18+'Dados de Entrada'!$B$20+'Dados de Entrada'!$B$19,AC$1+1,\"\"),\"\")","v":""},{"$f":"IFERROR(IF(AD$1+1<'Dados de Entrada'!$B$18+'Dados de Entrada'!$B$20+'Dados de Entrada'!$B$19,AD$1+1,\"\"),\"\")","v":""},{"$f":"IFERROR(IF(AE$1+1<'Dados de Entrada'!$B$18+'Dados de Entrada'!$B$20+'Dados de Entrada'!$B$19,AE$1+1,\"\"),\"\")","v":""},{"$f":"IFERROR(IF(AF$1+1<'Dados de Entrada'!$B$18+'Dados de Entrada'!$B$20+'Dados de Entrada'!$B$19,AF$1+1,\"\"),\"\")","v":""},{"$f":"IFERROR(IF(AG$1+1<'Dados de Entrada'!$B$18+'Dados de Entrada'!$B$20+'Dados de Entrada'!$B$19,AG$1+1,\"\"),\"\")","v":""},{"$f":"IFERROR(IF(AH$1+1<'Dados de Entrada'!$B$18+'Dados de Entrada'!$B$20+'Dados de Entrada'!$B$19,AH$1+1,\"\"),\"\")","v":""},{"$f":"IFERROR(IF(AI$1+1<'Dados de Entrada'!$B$18+'Dados de Entrada'!$B$20+'Dados de Entrada'!$B$19,AI$1+1,\"\"),\"\")","v":""},{"$f":"IFERROR(IF(AJ$1+1<'Dados de Entrada'!$B$18+'Dados de Entrada'!$B$20+'Dados de Entrada'!$B$19,AJ$1+1,\"\"),\"\")","v":""},{"$f":"IFERROR(IF(AK$1+1<'Dados de Entrada'!$B$18+'Dados de Entrada'!$B$20+'Dados de Entrada'!$B$19,AK$1+1,\"\"),\"\")","v":""},{"$f":"IFERROR(IF(AL$1+1<'Dados de Entrada'!$B$18+'Dados de Entrada'!$B$20+'Dados de Entrada'!$B$19,AL$1+1,\"\"),\"\")","v":""},{"$f":"IFERROR(IF(AM$1+1<'Dados de Entrada'!$B$18+'Dados de Entrada'!$B$20+'Dados de Entrada'!$B$19,AM$1+1,\"\"),\"\")","v":""},{"$f":"IFERROR(IF(AN$1+1<'Dados de Entrada'!$B$18+'Dados de Entrada'!$B$20+'Dados de Entrada'!$B$19,AN$1+1,\"\"),\"\")","v":""}]
["Quantidade Produzida em quilos (0)",{"$f":"IF(AND(B$1>='Dados de Entrada'!$B$19+'Dados de Entrada'!$B$18,B$1<='Dados de Entrada'!$B$21),'Dados de Entrada'!$B$30*1000,IF(B$1<'Dados de Entrada'!$B$19+'Dados de Entrada'!$B$18,0,\"\"))","v":0},{"$f":"IF(AND(C$1>='Dados de Entrada'!$B$19+'Dados de Entrada'!$B$18,C$1<='Dados de Entrada'!$B$21),'Dados de Entrada'!$B$30*1000,IF(C$1<'Dados de Entrada'!$B$19+'Dados de Entrada'!$B$18,0,\"\"))","v":0},{"$f":"IF(AND(D$1>='Dados de Entrada'!$B$19+'Dados de Entrada'!$B$18,D$1<='Dados de Entrada'!$B$21),'Dados de Entrada'!$B$30*1000,IF(D$1<'Dados de Entrada'!$B$19+'Dados de Entrada'!$B$18,0,\"\"))","v":810000},{"$f":"IF(AND(E$1>='Dados de Entrada'!$B$19+'Dados de Entrada'!$B$18,E$1<='Dados de Entrada'!$B$21),'Dados de Entrada'!$B$30*1000,IF(E$1<'Dados de Entrada'!$B$19+'Dados de Entrada'!$B$18,0,\"\"))","v":810000},{"$f":"IF(AND(F$1>='Dados de Entrada'!$B$19+'Dados de Entrada'!$B$18,F$1<='Dados de Entrada'!$B$21),'Dados de Entrada'!$B$30*1000,IF(F$1<'Dados de Entrada'!$B$19+'Dados de Entrada'!$B$18,0,\"\"))","v":810000},{"$f":"IF(AND(G$1>='Dados de Entrada'!$B$19+'Dados de Entrada'!$B$18,G$1<='Dados de Entrada'!$B$21),'Dados de Entrada'!$B$30*1000,IF(G$1<'Dados de Entrada'!$B$19+'Dados de Entrada'!$B$18,0,\"\"))","v":810000},{"$f":"IF(AND(H$1>='Dados de Entrada'!$B$19+'Dados de Entrada'!$B$18,H$1<='Dados de Entrada'!$B$21),'Dados de Entrada'!$B$30*1000,IF(H$1<'Dados de Entrada'!$B$19+'Dados de Entrada'!$B$18,0,\"\"))","v":810000},{"$f":"IF(AND(I$1>='Dados de Entrada'!$B$19+'Dados de Entrada'!$B$18,I$1<='Dados de Entrada'!$B$21),'Dados de Entrada'!$B$30*1000,IF(I$1<'Dados de Entrada'!$B$19+'Dados de Entrada'!$B$18,0,\"\"))","v":810000},{"$f":"IF(AND(J$1>='Dados de Entrada'!$B$19+'Dados de Entrada'!$B$18,J$1<='Dados de Entrada'!$B$21),'Dados de Entrada'!$B$30*1000,IF(J$1<'Dados de Entrada'!$B$19+'Dados de Entrada'!$B$18,0,\"\"))","v":810000},{"$f":"IF(AND(K$1>='Dados de Entrada'!$B$19+'Dados de Entrada'!$B$18,K$1<='Dados de Entrada'!$B$21),'Dados de Entrada'!$B$30*1000,IF(K$1<'Dados de Entrada'!$B$19+'Dados de Entrada'!$B$18,0,\"\"))","v":810000},{"$f":"IF(AND(L$1>='Dados de Entrada'!$B$19+'Dados de Entrada'!$B$18,L$1<='Dados de Entrada'!$B$21),'Dados de Entrada'!$B$30*1000,IF(L$1<'Dados de Entrada'!$B$19+'Dados de Entrada'!$B$18,0,\"\"))","v":810000},{"$f":"IF(AND(M$1>='Dados de Entrada'!$B$19+'Dados de Entrada'!$B$18,M$1<='Dados de Entrada'!$B$21),'Dados de Entrada'!$B$30*1000,IF(M$1<'Dados de Entrada'!$B$19+'Dados de Entrada'!$B$18,0,\"\"))","v":810000},{"$f":"IF(AND(N$1>='Dados de Entrada'!$B$19+'Dados de Entrada'!$B$18,N$1<='Dados de Entrada'!$B$21),'Dados de Entrada'!$B$30*1000,IF(N$1<'Dados de Entrada'!$B$19+'Dados de Entrada'!$B$18,0,\"\"))","v":810000},{"$f":"IF(AND(O$1>='Dados de Entrada'!$B$19+'Dados de Entrada'!$B$18,O$1<='Dados de Entrada'!$B$21),'Dados de Entrada'!$B$30*1000,IF(O$1<'Dados de Entrada'!$B$19+'Dados de Entrada'!$B$18,0,\"\"))","v":810000},{"$f":"IF(AND(P$1>='Dados de Entrada'!$B$19+'Dados de Entrada'!$B$18,P$1<='Dados de Entrada'!$B$21),'Dados de Entrada'!$B$30*1000,IF(P$1<'Dados de Entrada'!$B$19+'Dados de Entrada'!$B$18,0,\"\"))","v":810000},{"$f":"IF(AND(Q$1>='Dados de Entrada'!$B$19+'Dados de Entrada'!$B$18,Q$1<='Dados de Entrada'!$B$21),'Dados de Entrada'!$B$30*1000,IF(Q$1<'Dados de Entrada'!$B$19+'Dados de Entrada'!$B$18,0,\"\"))","v":810000},{"$f":"IF(AND(R$1>='Dados de Entrada'!$B$19+'Dados de Entrada'!$B$18,R$1<='Dados de Entrada'!$B$21),'Dados de Entrada'!$B$30*1000,IF(R$1<'Dados de Entrada'!$B$19+'Dados de Entrada'!$B$18,0,\"\"))","v":810000},{"$f":"IF(AND(S$1>='Dados de Entrada'!$B$19+'Dados de Entrada'!$B$18,S$1<='Dados de Entrada'!$B$21),'Dados de Entrada'!$B$30*1000,IF(S$1<'Dados de Entrada'!$B$19+'Dados de Entrada'!$B$18,0,\"\"))","v":810000},{"$f":"IF(AND(T$1>='Dados de Entrada'!$B$19+'Dados de Entrada'!$B$18,T$1<='Dados de Entrada'!$B$21),'Dados de Entrada'!$B$30*1000,IF(T$1<'Dados de Entrada'!$B$19+'Dados de Entrada'!$B$18,0,\"\"))","v":810000},{"$f":"IF(AND(U$1>='Dados de Entrada'!$B$19+'Dados de Entrada'!$B$18,U$1<='Dados de Entrada'!$B$21),'Dados de Entrada'!$B$30*1000,IF(U$1<'Dados de Entrada'!$B$19+'Dados de Entrada'!$B$18,0,\"\"))","v":810000},{"$f":"IF(AND(V$1>='Dados de Entrada'!$B$19+'Dados de Entrada'!$B$18,V$1<='Dados de Entrada'!$B$21),'Dados de Entrada'!$B$30*1000,IF(V$1<'Dados de Entrada'!$B$19+'Dados de Entrada'!$B$18,0,\"\"))","v":810000},{"$f":"IF(AND(W$1>='Dados de Entrada'!$B$19+'Dados de Entrada'!$B$18,W$1<='Dados de Entrada'!$B$21),'Dados de Entrada'!$B$30*1000,IF(W$1<'Dados de Entrada'!$B$19+'Dados de Entrada'!$B$18,0,\"\"))","v":810000},{"$f":"IF(AND(X$1>='Dados de Entrada'!$B$19+'Dados de Entrada'!$B$18,X$1<='Dados de Entrada'!$B$21),'Dados de Entrada'!$B$30*1000,IF(X$1<'Dados de Entrada'!$B$19+'Dados de Entrada'!$B$18,0,\"\"))","v":""},{"$f":"IF(AND(Y$1>='Dados de Entrada'!$B$19+'Dados de Entrada'!$B$18,Y$1<='Dados de Entrada'!$B$21),'Dados de Entrada'!$B$30*1000,IF(Y$1<'Dados de Entrada'!$B$19+'Dados de Entrada'!$B$18,0,\"\"))","v":""},{"$f":"IF(AND(Z$1>='Dados de Entrada'!$B$19+'Dados de Entrada'!$B$18,Z$1<='Dados de Entrada'!$B$21),'Dados de Entrada'!$B$30*1000,IF(Z$1<'Dados de Entrada'!$B$19+'Dados de Entrada'!$B$18,0,\"\"))","v":""},{"$f":"IF(AND(AA$1>='Dados de Entrada'!$B$19+'Dados de Entrada'!$B$18,AA$1<='Dados de Entrada'!$B$21),'Dados de Entrada'!$B$30*1000,IF(AA$1<'Dados de Entrada'!$B$19+'Dados de Entrada'!$B$18,0,\"\"))","v":""},{"$f":"IF(AND(AB$1>='Dados de Entrada'!$B$19+'Dados de Entrada'!$B$18,AB$1<='Dados de Entrada'!$B$21),'Dados de Entrada'!$B$30*1000,IF(AB$1<'Dados de Entrada'!$B$19+'Dados de Entrada'!$B$18,0,\"\"))","v":""},{"$f":"IF(AND(AC$1>='Dados de Entrada'!$B$19+'Dados de Entrada'!$B$18,AC$1<='Dados de Entrada'!$B$21),'Dados de Entrada'!$B$30*1000,IF(AC$1<'Dados de Entrada'!$B$19+'Dados de Entrada'!$B$18,0,\"\"))","v":""},{"$f":"IF(AND(AD$1>='Dados de Entrada'!$B$19+'Dados de Entrada'!$B$18,AD$1<='Dados de Entrada'!$B$21),'Dados de Entrada'!$B$30*1000,IF(AD$1<'Dados de Entrada'!$B$19+'Dados de Entrada'!$B$18,0,\"\"))","v":""},{"$f":"IF(AND(AE$1>='Dados de Entrada'!$B$19+'Dados de Entrada'!$B$18,AE$1<='Dados de Entrada'!$B$21),'Dados de Entrada'!$B$30*1000,IF(AE$1<'Dados de Entrada'!$B$19+'Dados de Entrada'!$B$18,0,\"\"))","v":""},{"$f":"IF(AND(AF$1>='Dados de Entrada'!$B$19+'Dados de Entrada'!$B$18,AF$1<='Dados de Entrada'!$B$21),'Dados de Entrada'!$B$30*1000,IF(AF$1<'Dados de Entrada'!$B$19+'Dados de Entrada'!$B$18,0,\"\"))","v":""},{"$f":"IF(AND(AG$1>='Dados de Entrada'!$B$19+'Dados de Entrada'!$B$18,AG$1<='Dados de Entrada'!$B$21),'Dados de Entrada'!$B$30*1000,IF(AG$1<'Dados de Entrada'!$B$19+'Dados de Entrada'!$B$18,0,\"\"))","v":""},{"$f":"IF(AND(AH$1>='Dados de Entrada'!$B$19+'Dados de Entrada'!$B$18,AH$1<='Dados de Entrada'!$B$21),'Dados de Entrada'!$B$30*1000,IF(AH$1<'Dados de Entrada'!$B$19+'Dados de Entrada'!$B$18,0,\"\"))","v":""},{"$f":"IF(AND(AI$1>='Dados de Entrada'!$B$19+'Dados de Entrada'!$B$18,AI$1<='Dados de Entrada'!$B$21),'Dados de Entrada'!$B$30*1000,IF(AI$1<'Dados de Entrada'!$B$19+'Dados de Entrada'!$B$18,0,\"\"))","v":""},{"$f":"IF(AND(AJ$1>='Dados de Entrada'!$B$19+'Dados de Entrada'!$B$18,AJ$1<='Dados de Entrada'!$B$21),'Dados de Entrada'!$B$30*1000,IF(AJ$1<'Dados de Entrada'!$B$19+'Dados de Entrada'!$B$18,0,\"\"))","v":""},{"$f":"IF(AND(AK$1>='Dados de Entrada'!$B$19+'Dados de Entrada'!$B$18,AK$1<='Dados de Entrada'!$B$21),'Dados de Entrada'!$B$30*1000,IF(AK$1<'Dados de Entrada'!$B$19+'Dados de Entrada'!$B$18,0,\"\"))","v":""},{"$f":"IF(AND(AL$1>='Dados de Entrada'!$B$19+'Dados de Entrada'!$B$18,AL$1<='Dados de Entrada'!$B$21),'Dados de Entrada'!$B$30*1000,IF(AL$1<'Dados de Entrada'!$B$19+'Dados de Entrada'!$B$18,0,\"\"))","v":""},{"$f":"IF(AND(AM$1>='Dados de Entrada'!$B$19+'Dados de Entrada'!$B$18,AM$1<='Dados de Entrada'!$B$21),'Dados de Entrada'!$B$30*1000,IF(AM$1<'Dados de Entrada'!$B$19+'Dados de Entrada'!$B$18,0,\"\"))","v":""},{"$f":"IF(AND(AN$1>='Dados de Entrada'!$B$19+'Dados de Entrada'!$B$18,AN$1<='Dados de Entrada'!$B$21),'Dados de Entrada'!$B$30*1000,IF(AN$1<'Dados de Entrada'!$B$19+'Dados de Entrada'!$B$18,0,\"\"))","v":""},{"$f":"IF(AND(AO$1>='Dados de Entrada'!$B$19+'Dados de Entrada'!$B$18,AO$1<='Dados de Entrada'!$B$21),'Dados de Entrada'!$B$30*1000,IF(AO$1<'Dados de Entrada'!$B$19+'Dados de Entrada'!$B$18,0,\"\"))","v":""}]
["Receita Bruta (1) = (0) * Preço",{"$f":"IF(AND(B$1>='Dados de Entrada'!$B$19+'Dados de Entrada'!$B$18,B$1<='Dados de Entrada'!$B$21),$B$40*B2,IF(B$1<'Dados de Entrada'!$B$19+'Dados de Entrada'!$B$18,0,\"\"))","v":0},{"$f":"IF(AND(C$1>='Dados de Entrada'!$B$19+'Dados de Entrada'!$B$18,C$1<='Dados de Entrada'!$B$21),$B$40*C2,IF(C$1<'Dados de Entrada'!$B$19+'Dados de Entrada'!$B$18,0,\"\"))","v":0},{"$f":"IF(AND(D$1>='Dados de Entrada'!$B$19+'Dados de Entrada'!$B$18,D$1<='Dados de Entrada'!$B$21),$B$40*D2,IF(D$1<'Dados de Entrada'!$B$19+'Dados de Entrada'!$B$18,0,\"\"))","v":4664216.1277448311},{"$f":"IF(AND(E$1>='Dados de Entrada'!$B$19+'Dados de Entrada'!$B$18,E$1<='Dados de Entrada'!$B$21),$B$40*E2,IF(E$1<'Dados de Entrada'!$B$19+'Dados de Entrada'!$B$18,0,\"\"))","v":4664216.1277448311},{"$f":"IF(AND(F$1>='Dados de Entrada'!$B$19+'Dados de Entrada'!$B$18,F$1<='Dados de Entrada'!$B$21),$B$40*F2,IF(F$1<'Dados de Entrada'!$B$19+'Dados de Entrada'!$B$18,0,\"\"))","v":4664216.1277448311},{"$f":"IF(AND(G$1>='Dados de Entrada'!$B$19+'Dados de Entrada'!$B$18,G$1<='Dados de Entrada'!$B$21),$B$40*G2,IF(G$1<'Dados de Entrada'!$B$19+'Dados de Entrada'!$B$18,0,\"\"))","v":4664216.1277448311},{"$f":"IF(AND(H$1>='Dados de Entrada'!$B$19+'Dados de Entrada'!$B$18,H$1<='Dados de Entrada'!$B$21),$B$40*H2,IF(H$1<'Dados de Entrada'!$B$19+'Dados de Entrada'!$B$18,0,\"\"))","v":4664216.1277448311},{"$f":"IF(AND(I$1>='Dados de Entrada'!$B$19+'Dados de Entrada'!$B$18,I$1<='Dados de Entrada'!$B$21),$B$40*I2,IF(I$1<'Dados de Entrada'!$B$19+'Dados de Entrada'!$B$18,0,\"\"))","v":4664216.1277448311},{"$f":"IF(AND(J$1>='Dados de Entrada'!$B$19+'Dados de Entrada'!$B$18,J$1<='Dados de Entrada'!$B$21),$B$40*J2,IF(J$1<'Dados de Entrada'!$B$19+'Dados de Entrada'!$B$18,0,\"\"))","v":4664216.1277448311},{"$f":"IF(AND(K$1>='Dados de Entrada'!$B$19+'Dados de Entrada'!$B$18,K$1<='Dados de Entrada'!$B$21),$B$40*K2,IF(K$1<'Dados de Entrada'!$B$19+'Dados de Entrada'!$B$18,0,\"\"))","v":4664216.1277448311},{"$f":"IF(AND(L$1>='Dados de Entrada'!$B$19+'Dados de Entrada'!$B$18,L$1<='Dados de Entrada'!$B$21),$B$40*L2,IF(L$1<'Dados de Entrada'!$B$19+'Dados de Entrada'!$B$18,0,\"\"))","v":4664216.1277448311},{"$f":"IF(AND(M$1>='Dados de Entrada'!$B$19+'Dados de Entrada'!$B$18,M$1<='Dados de Entrada'!$B$21),$B$40*M2,IF(M$1<'Dados de Entrada'!$B$19+'Dados de Entrada'!$B$18,0,\"\"))","v":4664216.1277448311},{"$f":"IF(AND(N$1>='Dados de Entrada'!$B$19+'Dados de Entrada'!$B$18,N$1<='Dados de Entrada'!$B$21),$B$40*N2,IF(N$1<'Dados de Entrada'!$B$19+'Dados de Entrada'!$B$18,0,\"\"))","v":4664216.1277448311},{"$f":"IF(AND(O$1>='Dados de Entrada'!$B$19+'Dados de Entrada'!$B$18,O$1<='Dados de Entrada'!$B$21),$B$40*O2,IF(O$1<'Dados de Entrada'!$B$19+'Dados de Entrada'!$B$18,0,\"\"))","v":4664216.1277448311},{"$f":"IF(AND(P$1>='Dados de Entrada'!$B$19+'Dados de Entrada'!$B$18,P$1<='Dados de Entrada'!$B$21),$B$40*P2,IF(P$1<'Dados de Entrada'!$B$19+'Dados de Entrada'!$B$18,0,\"\"))","v":4664216.1277448311},{"$f":"IF(AND(Q$1>='Dados de Entrada'!$B$19+'Dados de Entrada'!$B$18,Q$1<='Dados de Entrada'!$B$21),$B$40*Q2,IF(Q$1<'Dados de Entrada'!$B$19+'Dados de Entrada'!$B$18,0,\"\"))","v":4664216.1277448311},{"$f":"IF(AND(R$1>='Dados de Entrada'!$B$19+'Dados de Entrada'!$B$18,R$1<='Dados de Entrada'!$B$21),$B$40*R2,IF(R$1<'Dados de Entrada'!$B$19+'Dados de Entrada'!$B$18,0,\"\"))","v":4664216.1277448311},{"$f":"IF(AND(S$1>='Dados de Entrada'!$B$19+'Dados de Entrada'!$B$18,S$1<='Dados de Entrada'!$B$21),$B$40*S2,IF(S$1<'Dados de Entrada'!$B$19+'Dados de Entrada'!$B$18,0,\"\"))","v":4664216.1277448311},{"$f":"IF(AND(T$1>='Dados de Entrada'!$B$19+'Dados de Entrada'!$B$18,T$1<='Dados de Entrada'!$B$21),$B$40*T2,IF(T$1<'Dados de Entrada'!$B$19+'Dados de Entrada'!$B$18,0,\"\"))","v":4664216.1277448311},{"$f":"IF(AND(U$1>='Dados de Entrada'!$B$19+'Dados de Entrada'!$B$18,U$1<='Dados de Entrada'!$B$21),$B$40*U2,IF(U$1<'Dados de Entrada'!$B$19+'Dados de Entrada'!$B$18,0,\"\"))","v":4664216.1277448311},{"$f":"IF(AND(V$1>='Dados de Entrada'!$B$19+'Dados de Entrada'!$B$18,V$1<='Dados de Entrada'!$B$21),$B$40*V2,IF(V$1<'Dados de Entrada'!$B$19+'Dados de Entrada'!$B$18,0,\"\"))","v":4664216.1277448311},{"$f":"IF(AND(W$1>='Dados de Entrada'!$B$19+'Dados de Entrada'!$B$18,W$1<='Dados de Entrada'!$B$21),$B$40*W2,IF(W$1<'Dados de Entrada'!$B$19+'Dados de Entrada'!$B$18,0,\"\"))","v":4664216.1277448311},{"$f":"IF(AND(X$1>='Dados de Entrada'!$B$19+'Dados de Entrada'!$B$18,X$1<='Dados de Entrada'!$B$21),$B$40*X2,IF(X$1<'Dados de Entrada'!$B$19+'Dados de Entrada'!$B$18,0,\"\"))","v":""},{"$f":"IF(AND(Y$1>='Dados de Entrada'!$B$19+'Dados de Entrada'!$B$18,Y$1<='Dados de Entrada'!$B$21),$B$40*Y2,IF(Y$1<'Dados de Entrada'!$B$19+'Dados de Entrada'!$B$18,0,\"\"))","v":""},{"$f":"IF(AND(Z$1>='Dados de Entrada'!$B$19+'Dados de Entrada'!$B$18,Z$1<='Dados de Entrada'!$B$21),$B$40*Z2,IF(Z$1<'Dados de Entrada'!$B$19+'Dados de Entrada'!$B$18,0,\"\"))","v":""},{"$f":"IF(AND(AA$1>='Dados de Entrada'!$B$19+'Dados de Entrada'!$B$18,AA$1<='Dados de Entrada'!$B$21),$B$40*AA2,IF(AA$1<'Dados de Entrada'!$B$19+'Dados de Entrada'!$B$18,0,\"\"))","v":""},{"$f":"IF(AND(AB$1>='Dados de Entrada'!$B$19+'Dados de Entrada'!$B$18,AB$1<='Dados de Entrada'!$B$21),$B$40*AB2,IF(AB$1<'Dados de Entrada'!$B$19+'Dados de Entrada'!$B$18,0,\"\"))","v":""},{"$f":"IF(AND(AC$1>='Dados de Entrada'!$B$19+'Dados de Entrada'!$B$18,AC$1<='Dados de Entrada'!$B$21),$B$40*AC2,IF(AC$1<'Dados de Entrada'!$B$19+'Dados de Entrada'!$B$18,0,\"\"))","v":""},{"$f":"IF(AND(AD$1>='Dados de Entrada'!$B$19+'Dados de Entrada'!$B$18,AD$1<='Dados de Entrada'!$B$21),$B$40*AD2,IF(AD$1<'Dados de Entrada'!$B$19+'Dados de Entrada'!$B$18,0,\"\"))","v":""},{"$f":"IF(AND(AE$1>='Dados de Entrada'!$B$19+'Dados de Entrada'!$B$18,AE$1<='Dados de Entrada'!$B$21),$B$40*AE2,IF(AE$1<'Dados de Entrada'!$B$19+'Dados de Entrada'!$B$18,0,\"\"))","v":""},{"$f":"IF(AND(AF$1>='Dados de Entrada'!$B$19+'Dados de Entrada'!$B$18,AF$1<='Dados de Entrada'!$B$21),$B$40*AF2,IF(AF$1<'Dados de Entrada'!$B$19+'Dados de Entrada'!$B$18,0,\"\"))","v":""},{"$f":"IF(AND(AG$1>='Dados de Entrada'!$B$19+'Dados de Entrada'!$B$18,AG$1<='Dados de Entrada'!$B$21),$B$40*AG2,IF(AG$1<'Dados de Entrada'!$B$19+'Dados de Entrada'!$B$18,0,\"\"))","v":""},{"$f":"IF(AND(AH$1>='Dados de Entrada'!$B$19+'Dados de Entrada'!$B$18,AH$1<='Dados de Entrada'!$B$21),$B$40*AH2,IF(AH$1<'Dados de Entrada'!$B$19+'Dados de Entrada'!$B$18,0,\"\"))","v":""},{"$f":"IF(AND(AI$1>='Dados de Entrada'!$B$19+'Dados de Entrada'!$B$18,AI$1<='Dados de Entrada'!$B$21),$B$40*AI2,IF(AI$1<'Dados de Entrada'!$B$19+'Dados de Entrada'!$B$18,0,\"\"))","v":""},{"$f":"IF(AND(AJ$1>='Dados de Entrada'!$B$19+'Dados de Entrada'!$B$18,AJ$1<='Dados de Entrada'!$B$21),$B$40*AJ2,IF(AJ$1<'Dados de Entrada'!$B$19+'Dados de Entrada'!$B$18,0,\"\"))","v":""},{"$f":"IF(AND(AK$1>='Dados de Entrada'!$B$19+'Dados de Entrada'!$B$18,AK$1<='Dados de Entrada'!$B$21),$B$40*AK2,IF(AK$1<'Dados de Entrada'!$B$19+'Dados de Entrada'!$B$18,0,\"\"))","v":""},{"$f":"IF(AND(AL$1>='Dados de Entrada'!$B$19+'Dados de Entrada'!$B$18,AL$1<='Dados de Entrada'!$B$21),$B$40*AL2,IF(AL$1<'Dados de Entrada'!$B$19+'Dados de Entrada'!$B$18,0,\"\"))","v":""},{"$f":"IF(AND(AM$1>='Dados de Entrada'!$B$19+'Dados de Entrada'!$B$18,AM$1<='Dados de Entrada'!$B$21),$B$40*AM2,IF(AM$1<'Dados de Entrada'!$B$19+'Dados de Entrada'!$B$18,0,\"\"))","v":""},{"$f":"IF(AND(AN$1>='Dados de Entrada'!$B$19+'Dados de Entrada'!$B$18,AN$1<='Dados de Entrada'!$B$21),$B$40*AN2,IF(AN$1<'Dados de Entrada'!$B$19+'Dados de Entrada'!$B$18,0,\"\"))","v":""},{"$f":"IF(AND(AO$1>='Dados de Entrada'!$B$19+'Dados de Entrada'!$B$18,AO$1<='Dados de Entrada'!$B$21),$B$40*AO2,IF(AO$1<'Dados de Entrada'!$B$19+'Dados de Entrada'!$B$18,0,\"\"))","v":""}]
["Opex Total (2) = (2.1) + (2.2) + (2.3)",{"$f":"IF(AND(B$1>='Dados de Entrada'!$B$19+'Dados de Entrada'!$B$18,B$1<='Dados de Entrada'!$B$21),B5+B10,IF(B$1<'Dados de Entrada'!$B$19+'Dados de Entrada'!$B$18,0,\"\"))","v":0},{"$f":"IF(AND(C$1>='Dados de Entrada'!$B$19+'Dados de Entrada'!$B$18,C$1<='Dados de Entrada'!$B$21),C5+C10,IF(C$1<'Dados de Entrada'!$B$19+'Dados de Entrada'!$B$18,0,\"\"))","v":0},{"$f":"IF(AND(D$1>='Dados de Entrada'!$B$19+'Dados de Entrada'!$B$18,D$1<='Dados de Entrada'!$B$21),D5+D10,IF(D$1<'Dados de Entrada'!$B$19+'Dados de Entrada'!$B$18,0,\"\"))","v":3806119.7974342601},{"$f":"IF(AND(E$1>='Dados de Entrada'!$B$19+'Dados de Entrada'!$B$18,E$1<='Dados de Entrada'!$B$21),E5+E10,IF(E$1<'Dados de Entrada'!$B$19+'Dados de Entrada'!$B$18,0,\"\"))","v":3806119.7974342601},{"$f":"IF(AND(F$1>='Dados de Entrada'!$B$19+'Dados de Entrada'!$B$18,F$1<='Dados de Entrada'!$B$21),F5+F10,IF(F$1<'Dados de Entrada'!$B$19+'Dados de Entrada'!$B$18,0,\"\"))","v":3806119.7974342601},{"$f":"IF(AND(G$1>='Dados de Entrada'!$B$19+'Dados de Entrada'!$B$18,G$1<='Dados de Entrada'!$B$21),G5+G10,IF(G$1<'Dados de Entrada'!$B$19+'Dados de Entrada'!$B$18,0,\"\"))","v":3806119.7974342601},{"$f":"IF(AND(H$1>='Dados de Entrada'!$B$19+'Dados de Entrada'!$B$18,H$1<='Dados de Entrada'!$B$21),H5+H10,IF(H$1<'Dados de Entrada'!$B$19+'Dados de Entrada'!$B$18,0,\"\"))","v":3806119.7974342601},{"$f":"IF(AND(I$1>='Dados de Entrada'!$B$19+'Dados de Entrada'!$B$18,I$1<='Dados de Entrada'!$B$21),I5+I10,IF(I$1<'Dados de Entrada'!$B$19+'Dados de Entrada'!$B$18,0,\"\"))","v":3806119.7974342601},{"$f":"IF(AND(J$1>='Dados de Entrada'!$B$19+'Dados de Entrada'!$B$18,J$1<='Dados de Entrada'!$B$21),J5+J10,IF(J$1<'Dados de Entrada'!$B$19+'Dados de Entrada'!$B$18,0,\"\"))","v":3806119.7974342601},{"$f":"IF(AND(K$1>='Dados de Entrada'!$B$19+'Dados de Entrada'!$B$18,K$1<='Dados de Entrada'!$B$21),K5+K10,IF(K$1<'Dados de Entrada'!$B$19+'Dados de Entrada'!$B$18,0,\"\"))","v":3806119.7974342601},{"$f":"IF(AND(L$1>='Dados de Entrada'!$B$19+'Dados de Entrada'!$B$18,L$1<='Dados de Entrada'!$B$21),L5+L10,IF(L$1<'Dados de Entrada'!$B$19+'Dados de Entrada'!$B$18,0,\"\"))","v":3806119.7974342601},{"$f":"IF(AND(M$1>='Dados de Entrada'!$B$19+'Dados de Entrada'!$B$18,M$1<='Dados de Entrada'!$B$21),M5+M10,IF(M$1<'Dados de Entrada'!$B$19+'Dados de Entrada'!$B$18,0,\"\"))","v":3806119.7974342601},{"$f":"IF(AND(N$1>='Dados de Entrada'!$B$19+'Dados de Entrada'!$B$18,N$1<='Dados de Entrada'!$B$21),N5+N10,IF(N$1<'Dados de Entrada'!$B$19+'Dados de Entrada'!$B$18,0,\"\"))","v":3806119.7974342601},{"$f":"IF(AND(O$1>='Dados de Entrada'!$B$19+'Dados de Entrada'!$B$18,O$1<='Dados de Entrada'!$B$21),O5+O10,IF(O$1<'Dados de Entrada'!$B$19+'Dados de Entrada'!$B$18,0,\"\"))","v":3806119.7974342601},{"$f":"IF(AND(P$1>='Dados de Entrada'!$B$19+'Dados de Entrada'!$B$18,P$1<='Dados de Entrada'!$B$21),P5+P10,IF(P$1<'Dados de Entrada'!$B$19+'Dados de Entrada'!$B$18,0,\"\"))","v":3806119.7974342601},{"$f":"IF(AND(Q$1>='Dados de Entrada'!$B$19+'Dados de Entrada'!$B$18,Q$1<='Dados de Entrada'!$B$21),Q5+Q10,IF(Q$1<'Dados de Entrada'!$B$19+'Dados de Entrada'!$B$18,0,\"\"))","v":3806119.7974342601},{"$f":"IF(AND(R$1>='Dados de Entrada'!$B$19+'Dados de Entrada'!$B$18,R$1<='Dados de Entrada'!$B$21),R5+R10,IF(R$1<'Dados de Entrada'!$B$19+'Dados de Entrada'!$B$18,0,\"\"))","v":3806119.7974342601},{"$f":"IF(AND(S$1>='Dados de Entrada'!$B$19+'Dados de Entrada'!$B$18,S$1<='Dados de Entrada'!$B$21),S5+S10,IF(S$1<'Dados de Entrada'!$B$19+'Dados de Entrada'!$B$18,0,\"\"))","v":3806119.7974342601},{"$f":"IF(AND(T$1>='Dados de Entrada'!$B$19+'Dados de Entrada'!$B$18,T$1<='Dados de Entrada'!$B$21),T5+T10,IF(T$1<'Dados de Entrada'!$B$19+'Dados de Entrada'!$B$18,0,\"\"))","v":3806119.7974342601},{"$f":"IF(AND(U$1>='Dados de Entrada'!$B$19+'Dados de Entrada'!$B$18,U$1<='Dados de Entrada'!$B$21),U5+U10,IF(U$1<'Dados de Entrada'!$B$19+'Dados de Entrada'!$B$18,0,\"\"))","v":3806119.7974342601},{"$f":"IF(AND(V$1>='Dados de Entrada'!$B$19+'Dados de Entrada'!$B$18,V$1<='Dados de Entrada'!$B$21),V5+V10,IF(V$1<'Dados de Entrada'!$B$19+'Dados de Entrada'!$B$18,0,\"\"))","v":3806119.7974342601},{"$f":"IF(AND(W$1>='Dados de Entrada'!$B$19+'Dados de Entrada'!$B$18,W$1<='Dados de Entrada'!$B$21),W5+W10,IF(W$1<'Dados de Entrada'!$B$19+'Dados de Entrada'!$B$18,0,\"\"))","v":3806119.7974342601},{"$f":"IF(AND(X$1>='Dados de Entrada'!$B$19+'Dados de Entrada'!$B$18,X$1<='Dados de Entrada'!$B$21),X5+X10,IF(X$1<'Dados de Entrada'!$B$19+'Dados de Entrada'!$B$18,0,\"\"))","v":""},{"$f":"IF(AND(Y$1>='Dados de Entrada'!$B$19+'Dados de Entrada'!$B$18,Y$1<='Dados de Entrada'!$B$21),Y5+Y10,IF(Y$1<'Dados de Entrada'!$B$19+'Dados de Entrada'!$B$18,0,\"\"))","v":""},{"$f":"IF(AND(Z$1>='Dados de Entrada'!$B$19+'Dados de Entrada'!$B$18,Z$1<='Dados de Entrada'!$B$21),Z5+Z10,IF(Z$1<'Dados de Entrada'!$B$19+'Dados de Entrada'!$B$18,0,\"\"))","v":""},{"$f":"IF(AND(AA$1>='Dados de Entrada'!$B$19+'Dados de Entrada'!$B$18,AA$1<='Dados de Entrada'!$B$21),AA5+AA10,IF(AA$1<'Dados de Entrada'!$B$19+'Dados de Entrada'!$B$18,0,\"\"))","v":""},{"$f":"IF(AND(AB$1>='Dados de Entrada'!$B$19+'Dados de Entrada'!$B$18,AB$1<='Dados de Entrada'!$B$21),AB5+AB10,IF(AB$1<'Dados de Entrada'!$B$19+'Dados de Entrada'!$B$18,0,\"\"))","v":""},{"$f":"IF(AND(AC$1>='Dados de Entrada'!$B$19+'Dados de Entrada'!$B$18,AC$1<='Dados de Entrada'!$B$21),AC5+AC10,IF(AC$1<'Dados de Entrada'!$B$19+'Dados de Entrada'!$B$18,0,\"\"))","v":""},{"$f":"IF(AND(AD$1>='Dados de Entrada'!$B$19+'Dados de Entrada'!$B$18,AD$1<='Dados de Entrada'!$B$21),AD5+AD10,IF(AD$1<'Dados de Entrada'!$B$19+'Dados de Entrada'!$B$18,0,\"\"))","v":""},{"$f":"IF(AND(AE$1>='Dados de Entrada'!$B$19+'Dados de Entrada'!$B$18,AE$1<='Dados de Entrada'!$B$21),AE5+AE10,IF(AE$1<'Dados de Entrada'!$B$19+'Dados de Entrada'!$B$18,0,\"\"))","v":""},{"$f":"IF(AND(AF$1>='Dados de Entrada'!$B$19+'Dados de Entrada'!$B$18,AF$1<='Dados de Entrada'!$B$21),AF5+AF10,IF(AF$1<'Dados de Entrada'!$B$19+'Dados de Entrada'!$B$18,0,\"\"))","v":""},{"$f":"IF(AND(AG$1>='Dados de Entrada'!$B$19+'Dados de Entrada'!$B$18,AG$1<='Dados de Entrada'!$B$21),AG5+AG10,IF(AG$1<'Dados de Entrada'!$B$19+'Dados de Entrada'!$B$18,0,\"\"))","v":""},{"$f":"IF(AND(AH$1>='Dados de Entrada'!$B$19+'Dados de Entrada'!$B$18,AH$1<='Dados de Entrada'!$B$21),AH5+AH10,IF(AH$1<'Dados de Entrada'!$B$19+'Dados de Entrada'!$B$18,0,\"\"))","v":""},{"$f":"IF(AND(AI$1>='Dados de Entrada'!$B$19+'Dados de Entrada'!$B$18,AI$1<='Dados de Entrada'!$B$21),AI5+AI10,IF(AI$1<'Dados de Entrada'!$B$19+'Dados de Entrada'!$B$18,0,\"\"))","v":""},{"$f":"IF(AND(AJ$1>='Dados de Entrada'!$B$19+'Dados de Entrada'!$B$18,AJ$1<='Dados de Entrada'!$B$21),AJ5+AJ10,IF(AJ$1<'Dados de Entrada'!$B$19+'Dados de Entrada'!$B$18,0,\"\"))","v":""},{"$f":"IF(AND(AK$1>='Dados de Entrada'!$B$19+'Dados de Entrada'!$B$18,AK$1<='Dados de Entrada'!$B$21),AK5+AK10,IF(AK$1<'Dados de Entrada'!$B$19+'Dados de Entrada'!$B$18,0,\"\"))","v":""},{"$f":"IF(AND(AL$1>='Dados de Entrada'!$B$19+'Dados de Entrada'!$B$18,AL$1<='Dados de Entrada'!$B$21),AL5+AL10,IF(AL$1<'Dados de Entrada'!$B$19+'Dados de Entrada'!$B$18,0,\"\"))","v":""},{"$f":"IF(AND(AM$1>='Dados de Entrada'!$B$19+'Dados de Entrada'!$B$18,AM$1<='Dados de Entrada'!$B$21),AM5+AM10,IF(AM$1<'Dados de Entrada'!$B$19+'Dados de Entrada'!$B$18,0,\"\"))","v":""},{"$f":"IF(AND(AN$1>='Dados de Entrada'!$B$19+'Dados de Entrada'!$B$18,AN$1<='Dados de Entrada'!$B$21),AN5+AN10,IF(AN$1<'Dados de Entrada'!$B$19+'Dados de Entrada'!$B$18,0,\"\"))","v":""},{"$f":"IF(AND(AO$1>='Dados de Entrada'!$B$19+'Dados de Entrada'!$B$18,AO$1<='Dados de Entrada'!$B$21),AO5+AO10,IF(AO$1<'Dados de Entrada'!$B$19+'Dados de Entrada'!$B$18,0,\"\"))","v":""}]
["Opex da Produção (2.1) = (2.1.1) + (2.1.2) + (2.1.3) + (2.1.4)",{"$f":"IF(AND(B$1>='Dados de Entrada'!$B$19+'Dados de Entrada'!$B$18,B$1<='Dados de Entrada'!$B$21),SUM(B6:B9),IF(B$1<'Dados de Entrada'!$B$19+'Dados de Entrada'!$B$18,0,\"\"))","v":0},{"$f":"IF(AND(C$1>='Dados de Entrada'!$B$19+'Dados de Entrada'!$B$18,C$1<='Dados de Entrada'!$B$21),SUM(C6:C9),IF(C$1<'Dados de Entrada'!$B$19+'Dados de Entrada'!$B$18,0,\"\"))","v":0},{"$f":"IF(AND(D$1>='Dados de Entrada'!$B$19+'Dados de Entrada'!$B$18,D$1<='Dados de Entrada'!$B$21),SUM(D6:D9),IF(D$1<'Dados de Entrada'!$B$19+'Dados de Entrada'!$B$18,0,\"\"))","v":3806119.7974342601},{"$f":"IF(AND(E$1>='Dados de Entrada'!$B$19+'Dados de Entrada'!$B$18,E$1<='Dados de Entrada'!$B$21),SUM(E6:E9),IF(E$1<'Dados de Entrada'!$B$19+'Dados de Entrada'!$B$18,0,\"\"))","v":3806119.7974342601},{"$f":"IF(AND(F$1>='Dados de Entrada'!$B$19+'Dados de Entrada'!$B$18,F$1<='Dados de Entrada'!$B$21),SUM(F6:F9),IF(F$1<'Dados de Entrada'!$B$19+'Dados de Entrada'!$B$18,0,\"\"))","v":3806119.7974342601},{"$f":"IF(AND(G$1>='Dados de Entrada'!$B$19+'Dados de Entrada'!$B$18,G$1<='Dados de Entrada'!$B$21),SUM(G6:G9),IF(G$1<'Dados de Entrada'!$B$19+'Dados de Entrada'!$B$18,0,\"\"))","v":3806119.7974342601},{"$f":"IF(AND(H$1>='Dados de Entrada'!$B$19+'Dados de Entrada'!$B$18,H$1<='Dados de Entrada'!$B$21),SUM(H6:H9),IF(H$1<'Dados de Entrada'!$B$19+'Dados de Entrada'!$B$18,0,\"\"))","v":3806119.7974342601},{"$f":"IF(AND(I$1>='Dados de Entrada'!$B$19+'Dados de Entrada'!$B$18,I$1<='Dados de Entrada'!$B$21),SUM(I6:I9),IF(I$1<'Dados de Entrada'!$B$19+'Dados de Entrada'!$B$18,0,\"\"))","v":3806119.7974342601},{"$f":"IF(AND(J$1>='Dados de Entrada'!$B$19+'Dados de Entrada'!$B$18,J$1<='Dados de Entrada'!$B$21),SUM(J6:J9),IF(J$1<'Dados de Entrada'!$B$19+'Dados de Entrada'!$B$18,0,\"\"))","v":3806119.7974342601},{"$f":"IF(AND(K$1>='Dados de Entrada'!$B$19+'Dados de Entrada'!$B$18,K$1<='Dados de Entrada'!$B$21),SUM(K6:K9),IF(K$1<'Dados de Entrada'!$B$19+'Dados de Entrada'!$B$18,0,\"\"))","v":3806119.7974342601},{"$f":"IF(AND(L$1>='Dados de Entrada'!$B$19+'Dados de Entrada'!$B$18,L$1<='Dados de Entrada'!$B$21),SUM(L6:L9),IF(L$1<'Dados de Entrada'!$B$19+'Dados de Entrada'!$B$18,0,\"\"))","v":3806119.7974342601},{"$f":"IF(AND(M$1>='Dados de Entrada'!$B$19+'Dados de Entrada'!$B$18,M$1<='Dados de Entrada'!$B$21),SUM(M6:M9),IF(M$1<'Dados de Entrada'!$B$19+'Dados de Entrada'!$B$18,0,\"\"))","v":3806119.7974342601},{"$f":"IF(AND(N$1>='Dados de Entrada'!$B$19+'Dados de Entrada'!$B$18,N$1<='Dados de Entrada'!$B$21),SUM(N6:N9),IF(N$1<'Dados de Entrada'!$B$19+'Dados de Entrada'!$B$18,0,\"\"))","v":3806119.7974342601},{"$f":"IF(AND(O$1>='Dados de Entrada'!$B$19+'Dados de Entrada'!$B$18,O$1<='Dados de Entrada'!$B$21),SUM(O6:O9),IF(O$1<'Dados de Entrada'!$B$19+'Dados de Entrada'!$B$18,0,\"\"))","v":3806119.7974342601},{"$f":"IF(AND(P$1>='Dados de Entrada'!$B$19+'Dados de Entrada'!$B$18,P$1<='Dados de Entrada'!$B$21),SUM(P6:P9),IF(P$1<'Dados de Entrada'!$B$19+'Dados de Entrada'!$B$18,0,\"\"))","v":3806119.7974342601},{"$f":"IF(AND(Q$1>='Dados de Entrada'!$B$19+'Dados de Entrada'!$B$18,Q$1<='Dados de Entrada'!$B$21),SUM(Q6:Q9),IF(Q$1<'Dados de Entrada'!$B$19+'Dados de Entrada'!$B$18,0,\"\"))","v":3806119.7974342601},{"$f":"IF(AND(R$1>='Dados de Entrada'!$B$19+'Dados de Entrada'!$B$18,R$1<='Dados de Entrada'!$B$21),SUM(R6:R9),IF(R$1<'Dados de Entrada'!$B$19+'Dados de Entrada'!$B$18,0,\"\"))","v":3806119.7974342601},{"$f":"IF(AND(S$1>='Dados de Entrada'!$B$19+'Dados de Entrada'!$B$18,S$1<='Dados de Entrada'!$B$21),SUM(S6:S9),IF(S$1<'Dados de Entrada'!$B$19+'Dados de Entrada'!$B$18,0,\"\"))","v":3806119.7974342601},{"$f":"IF(AND(T$1>='Dados de Entrada'!$B$19+'Dados de Entrada'!$B$18,T$1<='Dados de Entrada'!$B$21),SUM(T6:T9),IF(T$1<'Dados de Entrada'!$B$19+'Dados de Entrada'!$B$18,0,\"\"))","v":3806119.7974342601},{"$f":"IF(AND(U$1>='Dados de Entrada'!$B$19+'Dados de Entrada'!$B$18,U$1<='Dados de Entrada'!$B$21),SUM(U6:U9),IF(U$1<'Dados de Entrada'!$B$19+'Dados de Entrada'!$B$18,0,\"\"))","v":3806119.7974342601},{"$f":"IF(AND(V$1>='Dados de Entrada'!$B$19+'Dados de Entrada'!$B$18,V$1<='Dados de Entrada'!$B$21),SUM(V6:V9),IF(V$1<'Dados de Entrada'!$B$19+'Dados de Entrada'!$B$18,0,\"\"))","v":3806119.7974342601},{"$f":"IF(AND(W$1>='Dados de Entrada'!$B$19+'Dados de Entrada'!$B$18,W$1<='Dados de Entrada'!$B$21),SUM(W6:W9),IF(W$1<'Dados de Entrada'!$B$19+'Dados de Entrada'!$B$18,0,\"\"))","v":3806119.7974342601},{"$f":"IF(AND(X$1>='Dados de Entrada'!$B$19+'Dados de Entrada'!$B$18,X$1<='Dados de Entrada'!$B$21),SUM(X6:X9),IF(X$1<'Dados de Entrada'!$B$19+'Dados de Entrada'!$B$18,0,\"\"))","v":""},{"$f":"IF(AND(Y$1>='Dados de Entrada'!$B$19+'Dados de Entrada'!$B$18,Y$1<='Dados de Entrada'!$B$21),SUM(Y6:Y9),IF(Y$1<'Dados de Entrada'!$B$19+'Dados de Entrada'!$B$18,0,\"\"))","v":""},{"$f":"IF(AND(Z$1>='Dados de Entrada'!$B$19+'Dados de Entrada'!$B$18,Z$1<='Dados de Entrada'!$B$21),SUM(Z6:Z9),IF(Z$1<'Dados de Entrada'!$B$19+'Dados de Entrada'!$B$18,0,\"\"))","v":""},{"$f":"IF(AND(AA$1>='Dados de Entrada'!$B$19+'Dados de Entrada'!$B$18,AA$1<='Dados de Entrada'!$B$21),SUM(AA6:AA9),IF(AA$1<'Dados de Entrada'!$B$19+'Dados de Entrada'!$B$18,0,\"\"))","v":""},{"$f":"IF(AND(AB$1>='Dados de Entrada'!$B$19+'Dados de Entrada'!$B$18,AB$1<='Dados de Entrada'!$B$21),SUM(AB6:AB9),IF(AB$1<'Dados de Entrada'!$B$19+'Dados de Entrada'!$B$18,0,\"\"))","v":""},{"$f":"IF(AND(AC$1>='Dados de Entrada'!$B$19+'Dados de Entrada'!$B$18,AC$1<='Dados de Entrada'!$B$21),SUM(AC6:AC9),IF(AC$1<'Dados de Entrada'!$B$19+'Dados de Entrada'!$B$18,0,\"\"))","v":""},{"$f":"IF(AND(AD$1>='Dados de Entrada'!$B$19+'Dados de Entrada'!$B$18,AD$1<='Dados de Entrada'!$B$21),SUM(AD6:AD9),IF(AD$1<'Dados de Entrada'!$B$19+'Dados de Entrada'!$B$18,0,\"\"))","v":""},{"$f":"IF(AND(AE$1>='Dados de Entrada'!$B$19+'Dados de Entrada'!$B$18,AE$1<='Dados de Entrada'!$B$21),SUM(AE6:AE9),IF(AE$1<'Dados de Entrada'!$B$19+'Dados de Entrada'!$B$18,0,\"\"))","v":""},{"$f":"IF(AND(AF$1>='Dados de Entrada'!$B$19+'Dados de Entrada'!$B$18,AF$1<='Dados de Entrada'!$B$21),SUM(AF6:AF9),IF(AF$1<'Dados de Entrada'!$B$19+'Dados de Entrada'!$B$18,0,\"\"))","v":""},{"$f":"IF(AND(AG$1>='Dados de Entrada'!$B$19+'Dados de Entrada'!$B$18,AG$1<='Dados de Entrada'!$B$21),SUM(AG6:AG9),IF(AG$1<'Dados de Entrada'!$B$19+'Dados de Entrada'!$B$18,0,\"\"))","v":""},{"$f":"IF(AND(AH$1>='Dados de Entrada'!$B$19+'Dados de Entrada'!$B$18,AH$1<='Dados de Entrada'!$B$21),SUM(AH6:AH9),IF(AH$1<'Dados de Entrada'!$B$19+'Dados de Entrada'!$B$18,0,\"\"))","v":""},{"$f":"IF(AND(AI$1>='Dados de Entrada'!$B$19+'Dados de Entrada'!$B$18,AI$1<='Dados de Entrada'!$B$21),SUM(AI6:AI9),IF(AI$1<'Dados de Entrada'!$B$19+'Dados de Entrada'!$B$18,0,\"\"))","v":""},{"$f":"IF(AND(AJ$1>='Dados de Entrada'!$B$19+'Dados de Entrada'!$B$18,AJ$1<='Dados de Entrada'!$B$21),SUM(AJ6:AJ9),IF(AJ$1<'Dados de Entrada'!$B$19+'Dados de Entrada'!$B$18,0,\"\"))","v":""},{"$f":"IF(AND(AK$1>='Dados de Entrada'!$B$19+'Dados de Entrada'!$B$18,AK$1<='Dados de Entrada'!$B$21),SUM(AK6:AK9),IF(AK$1<'Dados de Entrada'!$B$19+'Dados de Entrada'!$B$18,0,\"\"))","v":""},{"$f":"IF(AND(AL$1>='Dados de Entrada'!$B$19+'Dados de Entrada'!$B$18,AL$1<='Dados de Entrada'!$B$21),SUM(AL6:AL9),IF(AL$1<'Dados de Entrada'!$B$19+'Dados de Entrada'!$B$18,0,\"\"))","v":""},{"$f":"IF(AND(AM$1>='Dados de Entrada'!$B$19+'Dados de Entrada'!$B$18,AM$1<='Dados de Entrada'!$B$21),SUM(AM6:AM9),IF(AM$1<'Dados de Entrada'!$B$19+'Dados de Entrada'!$B$18,0,\"\"))","v":""},{"$f":"IF(AND(AN$1>='Dados de Entrada'!$B$19+'Dados de Entrada'!$B$18,AN$1<='Dados de Entrada'!$B$21),SUM(AN6:AN9),IF(AN$1<'Dados de Entrada'!$B$19+'Dados de Entrada'!$B$18,0,\"\"))","v":""},{"$f":"IF(AND(AO$1>='Dados de Entrada'!$B$19+'Dados de Entrada'!$B$18,AO$1<='Dados de Entrada'!$B$21),SUM(AO6:AO9),IF(AO$1<'Dados de Entrada'!$B$19+'Dados de Entrada'!$B$18,0,\"\"))","v":""}]
["Opex associado ao Etanol (2.1.1)",{"$f":"IF(AND(B$1>='Dados de Entrada'!$B$19+'Dados de Entrada'!$B$18,B$1<='Dados de Entrada'!$B$21),('Dados de Entrada'!$B$30*10^3)*'Dados de Entrada'!$B$44*'Dados de Entrada'!$B$40,IF(B$1<'Dados de Entrada'!$B$19+'Dados de Entrada'!$B$18,0,\"\"))","v":0},{"$f":"IF(AND(C$1>='Dados de Entrada'!$B$19+'Dados de Entrada'!$B$18,C$1<='Dados de Entrada'!$B$21),('Dados de Entrada'!$B$30*10^3)*'Dados de Entrada'!$B$44*'Dados de Entrada'!$B$40,IF(C$1<'Dados de Entrada'!$B$19+'Dados de Entrada'!$B$18,0,\"\"))","v":0},{"$f":"IF(AND(D$1>='Dados de Entrada'!$B$19+'Dados de Entrada'!$B$18,D$1<='Dados de Entrada'!$B$21),('Dados de Entrada'!$B$30*10^3)*'Dados de Entrada'!$B$44*'Dados de Entrada'!$B$40,IF(D$1<'Dados de Entrada'!$B$19+'Dados de Entrada'!$B$18,0,\"\"))","v":3432861.0000000005},{"$f":"IF(AND(E$1>='Dados de Entrada'!$B$19+'Dados de Entrada'!$B$18,E$1<='Dados de Entrada'!$B$21),('Dados de Entrada'!$B$30*10^3)*'Dados de Entrada'!$B$44*'Dados de Entrada'!$B$40,IF(E$1<'Dados de Entrada'!$B$19+'Dados de Entrada'!$B$18,0,\"\"))","v":3432861.0000000005},{"$f":"IF(AND(F$1>='Dados de Entrada'!$B$19+'Dados de Entrada'!$B$18,F$1<='Dados de Entrada'!$B$21),('Dados de Entrada'!$B$30*10^3)*'Dados de Entrada'!$B$44*'Dados de Entrada'!$B$40,IF(F$1<'Dados de Entrada'!$B$19+'Dados de Entrada'!$B$18,0,\"\"))","v":3432861.0000000005},{"$f":"IF(AND(G$1>='Dados de Entrada'!$B$19+'Dados de Entrada'!$B$18,G$1<='Dados de Entrada'!$B$21),('Dados de Entrada'!$B$30*10^3)*'Dados de Entrada'!$B$44*'Dados de Entrada'!$B$40,IF(G$1<'Dados de Entrada'!$B$19+'Dados de Entrada'!$B$18,0,\"\"))","v":3432861.0000000005},{"$f":"IF(AND(H$1>='Dados de Entrada'!$B$19+'Dados de Entrada'!$B$18,H$1<='Dados de Entrada'!$B$21),('Dados de Entrada'!$B$30*10^3)*'Dados de Entrada'!$B$44*'Dados de Entrada'!$B$40,IF(H$1<'Dados de Entrada'!$B$19+'Dados de Entrada'!$B$18,0,\"\"))","v":3432861.0000000005},{"$f":"IF(AND(I$1>='Dados de Entrada'!$B$19+'Dados de Entrada'!$B$18,I$1<='Dados de Entrada'!$B$21),('Dados de Entrada'!$B$30*10^3)*'Dados de Entrada'!$B$44*'Dados de Entrada'!$B$40,IF(I$1<'Dados de Entrada'!$B$19+'Dados de Entrada'!$B$18,0,\"\"))","v":3432861.0000000005},{"$f":"IF(AND(J$1>='Dados de Entrada'!$B$19+'Dados de Entrada'!$B$18,J$1<='Dados de Entrada'!$B$21),('Dados de Entrada'!$B$30*10^3)*'Dados de Entrada'!$B$44*'Dados de Entrada'!$B$40,IF(J$1<'Dados de Entrada'!$B$19+'Dados de Entrada'!$B$18,0,\"\"))","v":3432861.0000000005},{"$f":"IF(AND(K$1>='Dados de Entrada'!$B$19+'Dados de Entrada'!$B$18,K$1<='Dados de Entrada'!$B$21),('Dados de Entrada'!$B$30*10^3)*'Dados de Entrada'!$B$44*'Dados de Entrada'!$B$40,IF(K$1<'Dados de Entrada'!$B$19+'Dados de Entrada'!$B$18,0,\"\"))","v":3432861.0000000005},{"$f":"IF(AND(L$1>='Dados de Entrada'!$B$19+'Dados de Entrada'!$B$18,L$1<='Dados de Entrada'!$B$21),('Dados de Entrada'!$B$30*10^3)*'Dados de Entrada'!$B$44*'Dados de Entrada'!$B$40,IF(L$1<'Dados de Entrada'!$B$19+'Dados de Entrada'!$B$18,0,\"\"))","v":3432861.0000000005},{"$f":"IF(AND(M$1>='Dados de Entrada'!$B$19+'Dados de Entrada'!$B$18,M$1<='Dados de Entrada'!$B$21),('Dados de Entrada'!$B$30*10^3)*'Dados de Entrada'!$B$44*'Dados de Entrada'!$B$40,IF(M$1<'Dados de Entrada'!$B$19+'Dados de Entrada'!$B$18,0,\"\"))","v":3432861.0000000005},{"$f":"IF(AND(N$1>='Dados de Entrada'!$B$19+'Dados de Entrada'!$B$18,N$1<='Dados de Entrada'!$B$21),('Dados de Entrada'!$B$30*10^3)*'Dados de Entrada'!$B$44*'Dados de Entrada'!$B$40,IF(N$1<'Dados de Entrada'!$B$19+'Dados de Entrada'!$B$18,0,\"\"))","v":3432861.0000000005},{"$f":"IF(AND(O$1>='Dados de Entrada'!$B$19+'Dados de Entrada'!$B$18,O$1<='Dados de Entrada'!$B$21),('Dados de Entrada'!$B$30*10^3)*'Dados de Entrada'!$B$44*'Dados de Entrada'!$B$40,IF(O$1<'Dados de Entrada'!$B$19+'Dados de Entrada'!$B$18,0,\"\"))","v":3432861.0000000005},{"$f":"IF(AND(P$1>='Dados de Entrada'!$B$19+'Dados de Entrada'!$B$18,P$1<='Dados de Entrada'!$B$21),('Dados de Entrada'!$B$30*10^3)*'Dados de Entrada'!$B$44*'Dados de Entrada'!$B$40,IF(P$1<'Dados de Entrada'!$B$19+'Dados de Entrada'!$B$18,0,\"\"))","v":3432861.0000000005},{"$f":"IF(AND(Q$1>='Dados de Entrada'!$B$19+'Dados de Entrada'!$B$18,Q$1<='Dados de Entrada'!$B$21),('Dados de Entrada'!$B$30*10^3)*'Dados de Entrada'!$B$44*'Dados de Entrada'!$B$40,IF(Q$1<'Dados de Entrada'!$B$19+'Dados de Entrada'!$B$18,0,\"\"))","v":3432861.0000000005},{"$f":"IF(AND(R$1>='Dados de Entrada'!$B$19+'Dados de Entrada'!$B$18,R$1<='Dados de Entrada'!$B$21),('Dados de Entrada'!$B$30*10^3)*'Dados de Entrada'!$B$44*'Dados de Entrada'!$B$40,IF(R$1<'Dados de Entrada'!$B$19+'Dados de Entrada'!$B$18,0,\"\"))","v":3432861.0000000005},{"$f":"IF(AND(S$1>='Dados de Entrada'!$B$19+'Dados de Entrada'!$B$18,S$1<='Dados de Entrada'!$B$21),('Dados de Entrada'!$B$30*10^3)*'Dados de Entrada'!$B$44*'Dados de Entrada'!$B$40,IF(S$1<'Dados de Entrada'!$B$19+'Dados de Entrada'!$B$18,0,\"\"))","v":3432861.0000000005},{"$f":"IF(AND(T$1>='Dados de Entrada'!$B$19+'Dados de Entrada'!$B$18,T$1<='Dados de Entrada'!$B$21),('Dados de Entrada'!$B$30*10^3)*'Dados de Entrada'!$B$44*'Dados de Entrada'!$B$40,IF(T$1<'Dados de Entrada'!$B$19+'Dados de Entrada'!$B$18,0,\"\"))","v":3432861.0000000005},{"$f":"IF(AND(U$1>='Dados de Entrada'!$B$19+'Dados de Entrada'!$B$18,U$1<='Dados de Entrada'!$B$21),('Dados de Entrada'!$B$30*10^3)*'Dados de Entrada'!$B$44*'Dados de Entrada'!$B$40,IF(U$1<'Dados de Entrada'!$B$19+'Dados de Entrada'!$B$18,0,\"\"))","v":3432861.0000000005},{"$f":"IF(AND(V$1>='Dados de Entrada'!$B$19+'Dados de Entrada'!$B$18,V$1<='Dados de Entrada'!$B$21),('Dados de Entrada'!$B$30*10^3)*'Dados de Entrada'!$B$44*'Dados de Entrada'!$B$40,IF(V$1<'Dados de Entrada'!$B$19+'Dados de Entrada'!$B$18,0,\"\"))","v":3432861.0000000005},{"$f":"IF(AND(W$1>='Dados de Entrada'!$B$19+'Dados de Entrada'!$B$18,W$1<='Dados de Entrada'!$B$21),('Dados de Entrada'!$B$30*10^3)*'Dados de Entrada'!$B$44*'Dados de Entrada'!$B$40,IF(W$1<'Dados de Entrada'!$B$19+'Dados de Entrada'!$B$18,0,\"\"))","v":3432861.0000000005},{"$f":"IF(AND(X$1>='Dados de Entrada'!$B$19+'Dados de Entrada'!$B$18,X$1<='Dados de Entrada'!$B$21),('Dados de Entrada'!$B$30*10^3)*'Dados de Entrada'!$B$44*'Dados de Entrada'!$B$40,IF(X$1<'Dados de Entrada'!$B$19+'Dados de Entrada'!$B$18,0,\"\"))","v":""},{"$f":"IF(AND(Y$1>='Dados de Entrada'!$B$19+'Dados de Entrada'!$B$18,Y$1<='Dados de Entrada'!$B$21),('Dados de Entrada'!$B$30*10^3)*'Dados de Entrada'!$B$44*'Dados de Entrada'!$B$40,IF(Y$1<'Dados de Entrada'!$B$19+'Dados de Entrada'!$B$18,0,\"\"))","v":""},{"$f":"IF(AND(Z$1>='Dados de Entrada'!$B$19+'Dados de Entrada'!$B$18,Z$1<='Dados de Entrada'!$B$21),('Dados de Entrada'!$B$30*10^3)*'Dados de Entrada'!$B$44*'Dados de Entrada'!$B$40,IF(Z$1<'Dados de Entrada'!$B$19+'Dados de Entrada'!$B$18,0,\"\"))","v":""},{"$f":"IF(AND(AA$1>='Dados de Entrada'!$B$19+'Dados de Entrada'!$B$18,AA$1<='Dados de Entrada'!$B$21),('Dados de Entrada'!$B$30*10^3)*'Dados de Entrada'!$B$44*'Dados de Entrada'!$B$40,IF(AA$1<'Dados de Entrada'!$B$19+'Dados de Entrada'!$B$18,0,\"\"))","v":""},{"$f":"IF(AND(AB$1>='Dados de Entrada'!$B$19+'Dados de Entrada'!$B$18,AB$1<='Dados de Entrada'!$B$21),('Dados de Entrada'!$B$30*10^3)*'Dados de Entrada'!$B$44*'Dados de Entrada'!$B$40,IF(AB$1<'Dados de Entrada'!$B$19+'Dados de Entrada'!$B$18,0,\"\"))","v":""},{"$f":"IF(AND(AC$1>='Dados de Entrada'!$B$19+'Dados de Entrada'!$B$18,AC$1<='Dados de Entrada'!$B$21),('Dados de Entrada'!$B$30*10^3)*'Dados de Entrada'!$B$44*'Dados de Entrada'!$B$40,IF(AC$1<'Dados de Entrada'!$B$19+'Dados de Entrada'!$B$18,0,\"\"))","v":""},{"$f":"IF(AND(AD$1>='Dados de Entrada'!$B$19+'Dados de Entrada'!$B$18,AD$1<='Dados de Entrada'!$B$21),('Dados de Entrada'!$B$30*10^3)*'Dados de Entrada'!$B$44*'Dados de Entrada'!$B$40,IF(AD$1<'Dados de Entrada'!$B$19+'Dados de Entrada'!$B$18,0,\"\"))","v":""},{"$f":"IF(AND(AE$1>='Dados de Entrada'!$B$19+'Dados de Entrada'!$B$18,AE$1<='Dados de Entrada'!$B$21),('Dados de Entrada'!$B$30*10^3)*'Dados de Entrada'!$B$44*'Dados de Entrada'!$B$40,IF(AE$1<'Dados de Entrada'!$B$19+'Dados de Entrada'!$B$18,0,\"\"))","v":""},{"$f":"IF(AND(AF$1>='Dados de Entrada'!$B$19+'Dados de Entrada'!$B$18,AF$1<='Dados de Entrada'!$B$21),('Dados de Entrada'!$B$30*10^3)*'Dados de Entrada'!$B$44*'Dados de Entrada'!$B$40,IF(AF$1<'Dados de Entrada'!$B$19+'Dados de Entrada'!$B$18,0,\"\"))","v":""},{"$f":"IF(AND(AG$1>='Dados de Entrada'!$B$19+'Dados de Entrada'!$B$18,AG$1<='Dados de Entrada'!$B$21),('Dados de Entrada'!$B$30*10^3)*'Dados de Entrada'!$B$44*'Dados de Entrada'!$B$40,IF(AG$1<'Dados de Entrada'!$B$19+'Dados de Entrada'!$B$18,0,\"\"))","v":""},{"$f":"IF(AND(AH$1>='Dados de Entrada'!$B$19+'Dados de Entrada'!$B$18,AH$1<='Dados de Entrada'!$B$21),('Dados de Entrada'!$B$30*10^3)*'Dados de Entrada'!$B$44*'Dados de Entrada'!$B$40,IF(AH$1<'Dados de Entrada'!$B$19+'Dados de Entrada'!$B$18,0,\"\"))","v":""},{"$f":"IF(AND(AI$1>='Dados de Entrada'!$B$19+'Dados de Entrada'!$B$18,AI$1<='Dados de Entrada'!$B$21),('Dados de Entrada'!$B$30*10^3)*'Dados de Entrada'!$B$44*'Dados de Entrada'!$B$40,IF(AI$1<'Dados de Entrada'!$B$19+'Dados de Entrada'!$B$18,0,\"\"))","v":""},{"$f":"IF(AND(AJ$1>='Dados de Entrada'!$B$19+'Dados de Entrada'!$B$18,AJ$1<='Dados de Entrada'!$B$21),('Dados de Entrada'!$B$30*10^3)*'Dados de Entrada'!$B$44*'Dados de Entrada'!$B$40,IF(AJ$1<'Dados de Entrada'!$B$19+'Dados de Entrada'!$B$18,0,\"\"))","v":""},{"$f":"IF(AND(AK$1>='Dados de Entrada'!$B$19+'Dados de Entrada'!$B$18,AK$1<='Dados de Entrada'!$B$21),('Dados de Entrada'!$B$30*10^3)*'Dados de Entrada'!$B$44*'Dados de Entrada'!$B$40,IF(AK$1<'Dados de Entrada'!$B$19+'Dados de Entrada'!$B$18,0,\"\"))","v":""},{"$f":"IF(AND(AL$1>='Dados de Entrada'!$B$19+'Dados de Entrada'!$B$18,AL$1<='Dados de Entrada'!$B$21),('Dados de Entrada'!$B$30*10^3)*'Dados de Entrada'!$B$44*'Dados de Entrada'!$B$40,IF(AL$1<'Dados de Entrada'!$B$19+'Dados de Entrada'!$B$18,0,\"\"))","v":""},{"$f":"IF(AND(AM$1>='Dados de Entrada'!$B$19+'Dados de Entrada'!$B$18,AM$1<='Dados de Entrada'!$B$21),('Dados de Entrada'!$B$30*10^3)*'Dados de Entrada'!$B$44*'Dados de Entrada'!$B$40,IF(AM$1<'Dados de Entrada'!$B$19+'Dados de Entrada'!$B$18,0,\"\"))","v":""},{"$f":"IF(AND(AN$1>='Dados de Entrada'!$B$19+'Dados de Entrada'!$B$18,AN$1<='Dados de Entrada'!$B$21),('Dados de Entrada'!$B$30*10^3)*'Dados de Entrada'!$B$44*'Dados de Entrada'!$B$40,IF(AN$1<'Dados de Entrada'!$B$19+'Dados de Entrada'!$B$18,0,\"\"))","v":""},{"$f":"IF(AND(AO$1>='Dados de Entrada'!$B$19+'Dados de Entrada'!$B$18,AO$1<='Dados de Entrada'!$B$21),('Dados de Entrada'!$B$30*10^3)*'Dados de Entrada'!$B$44*'Dados de Entrada'!$B$40,IF(AO$1<'Dados de Entrada'!$B$19+'Dados de Entrada'!$B$18,0,\"\"))","v":""}]
["Opex associado à Energia Elétrica (2.1.2)",{"$f":"IF(AND(B$1>='Dados de Entrada'!$B$19+'Dados de Entrada'!$B$18,B$1<='Dados de Entrada'!$B$21),('Dados de Entrada'!$B$30*10^3)*'Dados de Entrada'!$B$42*'Dados de Entrada'!$B$38,IF(B$1<'Dados de Entrada'!$B$19+'Dados de Entrada'!$B$18,0,\"\"))","v":0},{"$f":"IF(AND(C$1>='Dados de Entrada'!$B$19+'Dados de Entrada'!$B$18,C$1<='Dados de Entrada'!$B$21),('Dados de Entrada'!$B$30*10^3)*'Dados de Entrada'!$B$42*'Dados de Entrada'!$B$38,IF(C$1<'Dados de Entrada'!$B$19+'Dados de Entrada'!$B$18,0,\"\"))","v":0},{"$f":"IF(AND(D$1>='Dados de Entrada'!$B$19+'Dados de Entrada'!$B$18,D$1<='Dados de Entrada'!$B$21),('Dados de Entrada'!$B$30*10^3)*'Dados de Entrada'!$B$42*'Dados de Entrada'!$B$38,IF(D$1<'Dados de Entrada'!$B$19+'Dados de Entrada'!$B$18,0,\"\"))","v":64719.000000000007},{"$f":"IF(AND(E$1>='Dados de Entrada'!$B$19+'Dados de Entrada'!$B$18,E$1<='Dados de Entrada'!$B$21),('Dados de Entrada'!$B$30*10^3)*'Dados de Entrada'!$B$42*'Dados de Entrada'!$B$38,IF(E$1<'Dados de Entrada'!$B$19+'Dados de Entrada'!$B$18,0,\"\"))","v":64719.000000000007},{"$f":"IF(AND(F$1>='Dados de Entrada'!$B$19+'Dados de Entrada'!$B$18,F$1<='Dados de Entrada'!$B$21),('Dados de Entrada'!$B$30*10^3)*'Dados de Entrada'!$B$42*'Dados de Entrada'!$B$38,IF(F$1<'Dados de Entrada'!$B$19+'Dados de Entrada'!$B$18,0,\"\"))","v":64719.000000000007},{"$f":"IF(AND(G$1>='Dados de Entrada'!$B$19+'Dados de Entrada'!$B$18,G$1<='Dados de Entrada'!$B$21),('Dados de Entrada'!$B$30*10^3)*'Dados de Entrada'!$B$42*'Dados de Entrada'!$B$38,IF(G$1<'Dados de Entrada'!$B$19+'Dados de Entrada'!$B$18,0,\"\"))","v":64719.000000000007},{"$f":"IF(AND(H$1>='Dados de Entrada'!$B$19+'Dados de Entrada'!$B$18,H$1<='Dados de Entrada'!$B$21),('Dados de Entrada'!$B$30*10^3)*'Dados de Entrada'!$B$42*'Dados de Entrada'!$B$38,IF(H$1<'Dados de Entrada'!$B$19+'Dados de Entrada'!$B$18,0,\"\"))","v":64719.000000000007},{"$f":"IF(AND(I$1>='Dados de Entrada'!$B$19+'Dados de Entrada'!$B$18,I$1<='Dados de Entrada'!$B$21),('Dados de Entrada'!$B$30*10^3)*'Dados de Entrada'!$B$42*'Dados de Entrada'!$B$38,IF(I$1<'Dados de Entrada'!$B$19+'Dados de Entrada'!$B$18,0,\"\"))","v":64719.000000000007},{"$f":"IF(AND(J$1>='Dados de Entrada'!$B$19+'Dados de Entrada'!$B$18,J$1<='Dados de Entrada'!$B$21),('Dados de Entrada'!$B$30*10^3)*'Dados de Entrada'!$B$42*'Dados de Entrada'!$B$38,IF(J$1<'Dados de Entrada'!$B$19+'Dados de Entrada'!$B$18,0,\"\"))","v":64719.000000000007},{"$f":"IF(AND(K$1>='Dados de Entrada'!$B$19+'Dados de Entrada'!$B$18,K$1<='Dados de Entrada'!$B$21),('Dados de Entrada'!$B$30*10^3)*'Dados de Entrada'!$B$42*'Dados de Entrada'!$B$38,IF(K$1<'Dados de Entrada'!$B$19+'Dados de Entrada'!$B$18,0,\"\"))","v":64719.000000000007},{"$f":"IF(AND(L$1>='Dados de Entrada'!$B$19+'Dados de Entrada'!$B$18,L$1<='Dados de Entrada'!$B$21),('Dados de Entrada'!$B$30*10^3)*'Dados de Entrada'!$B$42*'Dados de Entrada'!$B$38,IF(L$1<'Dados de Entrada'!$B$19+'Dados de Entrada'!$B$18,0,\"\"))","v":64719.000000000007},{"$f":"IF(AND(M$1>='Dados de Entrada'!$B$19+'Dados de Entrada'!$B$18,M$1<='Dados de Entrada'!$B$21),('Dados de Entrada'!$B$30*10^3)*'Dados de Entrada'!$B$42*'Dados de Entrada'!$B$38,IF(M$1<'Dados de Entrada'!$B$19+'Dados de Entrada'!$B$18,0,\"\"))","v":64719.000000000007},{"$f":"IF(AND(N$1>='Dados de Entrada'!$B$19+'Dados de Entrada'!$B$18,N$1<='Dados de Entrada'!$B$21),('Dados de Entrada'!$B$30*10^3)*'Dados de Entrada'!$B$42*'Dados de Entrada'!$B$38,IF(N$1<'Dados de Entrada'!$B$19+'Dados de Entrada'!$B$18,0,\"\"))","v":64719.000000000007},{"$f":"IF(AND(O$1>='Dados de Entrada'!$B$19+'Dados de Entrada'!$B$18,O$1<='Dados de Entrada'!$B$21),('Dados de Entrada'!$B$30*10^3)*'Dados de Entrada'!$B$42*'Dados de Entrada'!$B$38,IF(O$1<'Dados de Entrada'!$B$19+'Dados de Entrada'!$B$18,0,\"\"))","v":64719.000000000007},{"$f":"IF(AND(P$1>='Dados de Entrada'!$B$19+'Dados de Entrada'!$B$18,P$1<='Dados de Entrada'!$B$21),('Dados de Entrada'!$B$30*10^3)*'Dados de Entrada'!$B$42*'Dados de Entrada'!$B$38,IF(P$1<'Dados de Entrada'!$B$19+'Dados de Entrada'!$B$18,0,\"\"))","v":64719.000000000007},{"$f":"IF(AND(Q$1>='Dados de Entrada'!$B$19+'Dados de Entrada'!$B$18,Q$1<='Dados de Entrada'!$B$21),('Dados de Entrada'!$B$30*10^3)*'Dados de Entrada'!$B$42*'Dados de Entrada'!$B$38,IF(Q$1<'Dados de Entrada'!$B$19+'Dados de Entrada'!$B$18,0,\"\"))","v":64719.000000000007},{"$f":"IF(AND(R$1>='Dados de Entrada'!$B$19+'Dados de Entrada'!$B$18,R$1<='Dados de Entrada'!$B$21),('Dados de Entrada'!$B$30*10^3)*'Dados de Entrada'!$B$42*'Dados de Entrada'!$B$38,IF(R$1<'Dados de Entrada'!$B$19+'Dados de Entrada'!$B$18,0,\"\"))","v":64719.000000000007},{"$f":"IF(AND(S$1>='Dados de Entrada'!$B$19+'Dados de Entrada'!$B$18,S$1<='Dados de Entrada'!$B$21),('Dados de Entrada'!$B$30*10^3)*'Dados de Entrada'!$B$42*'Dados de Entrada'!$B$38,IF(S$1<'Dados de Entrada'!$B$19+'Dados de Entrada'!$B$18,0,\"\"))","v":64719.000000000007},{"$f":"IF(AND(T$1>='Dados de Entrada'!$B$19+'Dados de Entrada'!$B$18,T$1<='Dados de Entrada'!$B$21),('Dados de Entrada'!$B$30*10^3)*'Dados de Entrada'!$B$42*'Dados de Entrada'!$B$38,IF(T$1<'Dados de Entrada'!$B$19+'Dados de Entrada'!$B$18,0,\"\"))","v":64719.000000000007},{"$f":"IF(AND(U$1>='Dados de Entrada'!$B$19+'Dados de Entrada'!$B$18,U$1<='Dados de Entrada'!$B$21),('Dados de Entrada'!$B$30*10^3)*'Dados de Entrada'!$B$42*'Dados de Entrada'!$B$38,IF(U$1<'Dados de Entrada'!$B$19+'Dados de Entrada'!$B$18,0,\"\"))","v":64719.000000000007},{"$f":"IF(AND(V$1>='Dados de Entrada'!$B$19+'Dados de Entrada'!$B$18,V$1<='Dados de Entrada'!$B$21),('Dados de Entrada'!$B$30*10^3)*'Dados de Entrada'!$B$42*'Dados de Entrada'!$B$38,IF(V$1<'Dados de Entrada'!$B$19+'Dados de Entrada'!$B$18,0,\"\"))","v":64719.000000000007},{"$f":"IF(AND(W$1>='Dados de Entrada'!$B$19+'Dados de Entrada'!$B$18,W$1<='Dados de Entrada'!$B$21),('Dados de Entrada'!$B$30*10^3)*'Dados de Entrada'!$B$42*'Dados de Entrada'!$B$38,IF(W$1<'Dados de Entrada'!$B$19+'Dados de Entrada'!$B$18,0,\"\"))","v":64719.000000000007},{"$f":"IF(AND(X$1>='Dados de Entrada'!$B$19+'Dados de Entrada'!$B$18,X$1<='Dados de Entrada'!$B$21),('Dados de Entrada'!$B$30*10^3)*'Dados de Entrada'!$B$42*'Dados de Entrada'!$B$38,IF(X$1<'Dados de Entrada'!$B$19+'Dados de Entrada'!$B$18,0,\"\"))","v":""},{"$f":"IF(AND(Y$1>='Dados de Entrada'!$B$19+'Dados de Entrada'!$B$18,Y$1<='Dados de Entrada'!$B$21),('Dados de Entrada'!$B$30*10^3)*'Dados de Entrada'!$B$42*'Dados de Entrada'!$B$38,IF(Y$1<'Dados de Entrada'!$B$19+'Dados de Entrada'!$B$18,0,\"\"))","v":""},{"$f":"IF(AND(Z$1>='Dados de Entrada'!$B$19+'Dados de Entrada'!$B$18,Z$1<='Dados de Entrada'!$B$21),('Dados de Entrada'!$B$30*10^3)*'Dados de Entrada'!$B$42*'Dados de Entrada'!$B$38,IF(Z$1<'Dados de Entrada'!$B$19+'Dados de Entrada'!$B$18,0,\"\"))","v":""},{"$f":"IF(AND(AA$1>='Dados de Entrada'!$B$19+'Dados de Entrada'!$B$18,AA$1<='Dados de Entrada'!$B$21),('Dados de Entrada'!$B$30*10^3)*'Dados de Entrada'!$B$42*'Dados de Entrada'!$B$38,IF(AA$1<'Dados de Entrada'!$B$19+'Dados de Entrada'!$B$18,0,\"\"))","v":""},{"$f":"IF(AND(AB$1>='Dados de Entrada'!$B$19+'Dados de Entrada'!$B$18,AB$1<='Dados de Entrada'!$B$21),('Dados de Entrada'!$B$30*10^3)*'Dados de Entrada'!$B$42*'Dados de Entrada'!$B$38,IF(AB$1<'Dados de Entrada'!$B$19+'Dados de Entrada'!$B$18,0,\"\"))","v":""},{"$f":"IF(AND(AC$1>='Dados de Entrada'!$B$19+'Dados de Entrada'!$B$18,AC$1<='Dados de Entrada'!$B$21),('Dados de Entrada'!$B$30*10^3)*'Dados de Entrada'!$B$42*'Dados de Entrada'!$B$38,IF(AC$1<'Dados de Entrada'!$B$19+'Dados de Entrada'!$B$18,0,\"\"))","v":""},{"$f":"IF(AND(AD$1>='Dados de Entrada'!$B$19+'Dados de Entrada'!$B$18,AD$1<='Dados de Entrada'!$B$21),('Dados de Entrada'!$B$30*10^3)*'Dados de Entrada'!$B$42*'Dados de Entrada'!$B$38,IF(AD$1<'Dados de Entrada'!$B$19+'Dados de Entrada'!$B$18,0,\"\"))","v":""},{"$f":"IF(AND(AE$1>='Dados de Entrada'!$B$19+'Dados de Entrada'!$B$18,AE$1<='Dados de Entrada'!$B$21),('Dados de Entrada'!$B$30*10^3)*'Dados de Entrada'!$B$42*'Dados de Entrada'!$B$38,IF(AE$1<'Dados de Entrada'!$B$19+'Dados de Entrada'!$B$18,0,\"\"))","v":""},{"$f":"IF(AND(AF$1>='Dados de Entrada'!$B$19+'Dados de Entrada'!$B$18,AF$1<='Dados de Entrada'!$B$21),('Dados de Entrada'!$B$30*10^3)*'Dados de Entrada'!$B$42*'Dados de Entrada'!$B$38,IF(AF$1<'Dados de Entrada'!$B$19+'Dados de Entrada'!$B$18,0,\"\"))","v":""},{"$f":"IF(AND(AG$1>='Dados de Entrada'!$B$19+'Dados de Entrada'!$B$18,AG$1<='Dados de Entrada'!$B$21),('Dados de Entrada'!$B$30*10^3)*'Dados de Entrada'!$B$42*'Dados de Entrada'!$B$38,IF(AG$1<'Dados de Entrada'!$B$19+'Dados de Entrada'!$B$18,0,\"\"))","v":""},{"$f":"IF(AND(AH$1>='Dados de Entrada'!$B$19+'Dados de Entrada'!$B$18,AH$1<='Dados de Entrada'!$B$21),('Dados de Entrada'!$B$30*10^3)*'Dados de Entrada'!$B$42*'Dados de Entrada'!$B$38,IF(AH$1<'Dados de Entrada'!$B$19+'Dados de Entrada'!$B$18,0,\"\"))","v":""},{"$f":"IF(AND(AI$1>='Dados de Entrada'!$B$19+'Dados de Entrada'!$B$18,AI$1<='Dados de Entrada'!$B$21),('Dados de Entrada'!$B$30*10^3)*'Dados de Entrada'!$B$42*'Dados de Entrada'!$B$38,IF(AI$1<'Dados de Entrada'!$B$19+'Dados de Entrada'!$B$18,0,\"\"))","v":""},{"$f":"IF(AND(AJ$1>='Dados de Entrada'!$B$19+'Dados de Entrada'!$B$18,AJ$1<='Dados de Entrada'!$B$21),('Dados de Entrada'!$B$30*10^3)*'Dados de Entrada'!$B$42*'Dados de Entrada'!$B$38,IF(AJ$1<'Dados de Entrada'!$B$19+'Dados de Entrada'!$B$18,0,\"\"))","v":""},{"$f":"IF(AND(AK$1>='Dados de Entrada'!$B$19+'Dados de Entrada'!$B$18,AK$1<='Dados de Entrada'!$B$21),('Dados de Entrada'!$B$30*10^3)*'Dados de Entrada'!$B$42*'Dados de Entrada'!$B$38,IF(AK$1<'Dados de Entrada'!$B$19+'Dados de Entrada'!$B$18,0,\"\"))","v":""},{"$f":"IF(AND(AL$1>='Dados de Entrada'!$B$19+'Dados de Entrada'!$B$18,AL$1<='Dados de Entrada'!$B$21),('Dados de Entrada'!$B$30*10^3)*'Dados de Entrada'!$B$42*'Dados de Entrada'!$B$38,IF(AL$1<'Dados de Entrada'!$B$19+'Dados de Entrada'!$B$18,0,\"\"))","v":""},{"$f":"IF(AND(AM$1>='Dados de Entrada'!$B$19+'Dados de Entrada'!$B$18,AM$1<='Dados de Entrada'!$B$21),('Dados de Entrada'!$B$30*10^3)*'Dados de Entrada'!$B$42*'Dados de Entrada'!$B$38,IF(AM$1<'Dados de Entrada'!$B$19+'Dados de Entrada'!$B$18,0,\"\"))","v":""},{"$f":"IF(AND(AN$1>='Dados de Entrada'!$B$19+'Dados de Entrada'!$B$18,AN$1<='Dados de Entrada'!$B$21),('Dados de Entrada'!$B$30*10^3)*'Dados de Entrada'!$B$42*'Dados de Entrada'!$B$38,IF(AN$1<'Dados de Entrada'!$B$19+'Dados de Entrada'!$B$18,0,\"\"))","v":""},{"$f":"IF(AND(AO$1>='Dados de Entrada'!$B$19+'Dados de Entrada'!$B$18,AO$1<='Dados de Entrada'!$B$21),('Dados de Entrada'!$B$30*10^3)*'Dados de Entrada'!$B$42*'Dados de Entrada'!$B$38,IF(AO$1<'Dados de Entrada'!$B$19+'Dados de Entrada'!$B$18,0,\"\"))","v":""}]
["Opex associado à Água (2.1.3)",{"$f":"IF(AND(B$1>='Dados de Entrada'!$B$19+'Dados de Entrada'!$B$18,B$1<='Dados de Entrada'!$B$21),('Dados de Entrada'!$B$30*10^3)*'Dados de Entrada'!$B$43*'Dados de Entrada'!$B$39,IF(B$1<'Dados de Entrada'!$B$19+'Dados de Entrada'!$B$18,0,\"\"))","v":0},{"$f":"IF(AND(C$1>='Dados de Entrada'!$B$19+'Dados de Entrada'!$B$18,C$1<='Dados de Entrada'!$B$21),('Dados de Entrada'!$B$30*10^3)*'Dados de Entrada'!$B$43*'Dados de Entrada'!$B$39,IF(C$1<'Dados de Entrada'!$B$19+'Dados de Entrada'!$B$18,0,\"\"))","v":0},{"$f":"IF(AND(D$1>='Dados de Entrada'!$B$19+'Dados de Entrada'!$B$18,D$1<='Dados de Entrada'!$B$21),('Dados de Entrada'!$B$30*10^3)*'Dados de Entrada'!$B$43*'Dados de Entrada'!$B$39,IF(D$1<'Dados de Entrada'!$B$19+'Dados de Entrada'!$B$18,0,\"\"))","v":24300},{"$f":"IF(AND(E$1>='Dados de Entrada'!$B$19+'Dados de Entrada'!$B$18,E$1<='Dados de Entrada'!$B$21),('Dados de Entrada'!$B$30*10^3)*'Dados de Entrada'!$B$43*'Dados de Entrada'!$B$39,IF(E$1<'Dados de Entrada'!$B$19+'Dados de Entrada'!$B$18,0,\"\"))","v":24300},{"$f":"IF(AND(F$1>='Dados de Entrada'!$B$19+'Dados de Entrada'!$B$18,F$1<='Dados de Entrada'!$B$21),('Dados de Entrada'!$B$30*10^3)*'Dados de Entrada'!$B$43*'Dados de Entrada'!$B$39,IF(F$1<'Dados de Entrada'!$B$19+'Dados de Entrada'!$B$18,0,\"\"))","v":24300},{"$f":"IF(AND(G$1>='Dados de Entrada'!$B$19+'Dados de Entrada'!$B$18,G$1<='Dados de Entrada'!$B$21),('Dados de Entrada'!$B$30*10^3)*'Dados de Entrada'!$B$43*'Dados de Entrada'!$B$39,IF(G$1<'Dados de Entrada'!$B$19+'Dados de Entrada'!$B$18,0,\"\"))","v":24300},{"$f":"IF(AND(H$1>='Dados de Entrada'!$B$19+'Dados de Entrada'!$B$18,H$1<='Dados de Entrada'!$B$21),('Dados de Entrada'!$B$30*10^3)*'Dados de Entrada'!$B$43*'Dados de Entrada'!$B$39,IF(H$1<'Dados de Entrada'!$B$19+'Dados de Entrada'!$B$18,0,\"\"))","v":24300},{"$f":"IF(AND(I$1>='Dados de Entrada'!$B$19+'Dados de Entrada'!$B$18,I$1<='Dados de Entrada'!$B$21),('Dados de Entrada'!$B$30*10^3)*'Dados de Entrada'!$B$43*'Dados de Entrada'!$B$39,IF(I$1<'Dados de Entrada'!$B$19+'Dados de Entrada'!$B$18,0,\"\"))","v":24300},{"$f":"IF(AND(J$1>='Dados de Entrada'!$B$19+'Dados de Entrada'!$B$18,J$1<='Dados de Entrada'!$B$21),('Dados de Entrada'!$B$30*10^3)*'Dados de Entrada'!$B$43*'Dados de Entrada'!$B$39,IF(J$1<'Dados de Entrada'!$B$19+'Dados de Entrada'!$B$18,0,\"\"))","v":24300},{"$f":"IF(AND(K$1>='Dados de Entrada'!$B$19+'Dados de Entrada'!$B$18,K$1<='Dados de Entrada'!$B$21),('Dados de Entrada'!$B$30*10^3)*'Dados de Entrada'!$B$43*'Dados de Entrada'!$B$39,IF(K$1<'Dados de Entrada'!$B$19+'Dados de Entrada'!$B$18,0,\"\"))","v":24300},{"$f":"IF(AND(L$1>='Dados de Entrada'!$B$19+'Dados de Entrada'!$B$18,L$1<='Dados de Entrada'!$B$21),('Dados de Entrada'!$B$30*10^3)*'Dados de Entrada'!$B$43*'Dados de Entrada'!$B$39,IF(L$1<'Dados de Entrada'!$B$19+'Dados de Entrada'!$B$18,0,\"\"))","v":24300},{"$f":"IF(AND(M$1>='Dados de Entrada'!$B$19+'Dados de Entrada'!$B$18,M$1<='Dados de Entrada'!$B$21),('Dados de Entrada'!$B$30*10^3)*'Dados de Entrada'!$B$43*'Dados de Entrada'!$B$39,IF(M$1<'Dados de Entrada'!$B$19+'Dados de Entrada'!$B$18,0,\"\"))","v":24300},{"$f":"IF(AND(N$1>='Dados de Entrada'!$B$19+'Dados de Entrada'!$B$18,N$1<='Dados de Entrada'!$B$21),('Dados de Entrada'!$B$30*10^3)*'Dados de Entrada'!$B$43*'Dados de Entrada'!$B$39,IF(N$1<'Dados de Entrada'!$B$19+'Dados de Entrada'!$B$18,0,\"\"))","v":24300},{"$f":"IF(AND(O$1>='Dados de Entrada'!$B$19+'Dados de Entrada'!$B$18,O$1<='Dados de Entrada'!$B$21),('Dados de Entrada'!$B$30*10^3)*'Dados de Entrada'!$B$43*'Dados de Entrada'!$B$39,IF(O$1<'Dados de Entrada'!$B$19+'Dados de Entrada'!$B$18,0,\"\"))","v":24300},{"$f":"IF(AND(P$1>='Dados de Entrada'!$B$19+'Dados de Entrada'!$B$18,P$1<='Dados de Entrada'!$B$21),('Dados de Entrada'!$B$30*10^3)*'Dados de Entrada'!$B$43*'Dados de Entrada'!$B$39,IF(P$1<'Dados de Entrada'!$B$19+'Dados de Entrada'!$B$18,0,\"\"))","v":24300},{"$f":"IF(AND(Q$1>='Dados de Entrada'!$B$19+'Dados de Entrada'!$B$18,Q$1<='Dados de Entrada'!$B$21),('Dados de Entrada'!$B$30*10^3)*'Dados de Entrada'!$B$43*'Dados de Entrada'!$B$39,IF(Q$1<'Dados de Entrada'!$B$19+'Dados de Entrada'!$B$18,0,\"\"))","v":24300},{"$f":"IF(AND(R$1>='Dados de Entrada'!$B$19+'Dados de Entrada'!$B$18,R$1<='Dados de Entrada'!$B$21),('Dados de Entrada'!$B$30*10^3)*'Dados de Entrada'!$B$43*'Dados de Entrada'!$B$39,IF(R$1<'Dados de Entrada'!$B$19+'Dados de Entrada'!$B$18,0,\"\"))","v":24300},{"$f":"IF(AND(S$1>='Dados de Entrada'!$B$19+'Dados de Entrada'!$B$18,S$1<='Dados de Entrada'!$B$21),('Dados de Entrada'!$B$30*10^3)*'Dados de Entrada'!$B$43*'Dados de Entrada'!$B$39,IF(S$1<'Dados de Entrada'!$B$19+'Dados de Entrada'!$B$18,0,\"\"))","v":24300},{"$f":"IF(AND(T$1>='Dados de Entrada'!$B$19+'Dados de Entrada'!$B$18,T$1<='Dados de Entrada'!$B$21),('Dados de Entrada'!$B$30*10^3)*'Dados de Entrada'!$B$43*'Dados de Entrada'!$B$39,IF(T$1<'Dados de Entrada'!$B$19+'Dados de Entrada'!$B$18,0,\"\"))","v":24300},{"$f":"IF(AND(U$1>='Dados de Entrada'!$B$19+'Dados de Entrada'!$B$18,U$1<='Dados de Entrada'!$B$21),('Dados de Entrada'!$B$30*10^3)*'Dados de Entrada'!$B$43*'Dados de Entrada'!$B$39,IF(U$1<'Dados de Entrada'!$B$19+'Dados de Entrada'!$B$18,0,\"\"))","v":24300},{"$f":"IF(AND(V$1>='Dados de Entrada'!$B$19+'Dados de Entrada'!$B$18,V$1<='Dados de Entrada'!$B$21),('Dados de Entrada'!$B$30*10^3)*'Dados de Entrada'!$B$43*'Dados de Entrada'!$B$39,IF(V$1<'Dados de Entrada'!$B$19+'Dados de Entrada'!$B$18,0,\"\"))","v":24300},{"$f":"IF(AND(W$1>='Dados de Entrada'!$B$19+'Dados de Entrada'!$B$18,W$1<='Dados de Entrada'!$B$21),('Dados de Entrada'!$B$30*10^3)*'Dados de Entrada'!$B$43*'Dados de Entrada'!$B$39,IF(W$1<'Dados de Entrada'!$B$19+'Dados de Entrada'!$B$18,0,\"\"))","v":24300},{"$f":"IF(AND(X$1>='Dados de Entrada'!$B$19+'Dados de Entrada'!$B$18,X$1<='Dados de Entrada'!$B$21),('Dados de Entrada'!$B$30*10^3)*'Dados de Entrada'!$B$43*'Dados de Entrada'!$B$39,IF(X$1<'Dados de Entrada'!$B$19+'Dados de Entrada'!$B$18,0,\"\"))","v":""},{"$f":"IF(AND(Y$1>='Dados de Entrada'!$B$19+'Dados de Entrada'!$B$18,Y$1<='Dados de Entrada'!$B$21),('Dados de Entrada'!$B$30*10^3)*'Dados de Entrada'!$B$43*'Dados de Entrada'!$B$39,IF(Y$1<'Dados de Entrada'!$B$19+'Dados de Entrada'!$B$18,0,\"\"))","v":""},{"$f":"IF(AND(Z$1>='Dados de Entrada'!$B$19+'Dados de Entrada'!$B$18,Z$1<='Dados de Entrada'!$B$21),('Dados de Entrada'!$B$30*10^3)*'Dados de Entrada'!$B$43*'Dados de Entrada'!$B$39,IF(Z$1<'Dados de Entrada'!$B$19+'Dados de Entrada'!$B$18,0,\"\"))","v":""},{"$f":"IF(AND(AA$1>='Dados de Entrada'!$B$19+'Dados de Entrada'!$B$18,AA$1<='Dados de Entrada'!$B$21),('Dados de Entrada'!$B$30*10^3)*'Dados de Entrada'!$B$43*'Dados de Entrada'!$B$39,IF(AA$1<'Dados de Entrada'!$B$19+'Dados de Entrada'!$B$18,0,\"\"))","v":""},{"$f":"IF(AND(AB$1>='Dados de Entrada'!$B$19+'Dados de Entrada'!$B$18,AB$1<='Dados de Entrada'!$B$21),('Dados de Entrada'!$B$30*10^3)*'Dados de Entrada'!$B$43*'Dados de Entrada'!$B$39,IF(AB$1<'Dados de Entrada'!$B$19+'Dados de Entrada'!$B$18,0,\"\"))","v":""},{"$f":"IF(AND(AC$1>='Dados de Entrada'!$B$19+'Dados de Entrada'!$B$18,AC$1<='Dados de Entrada'!$B$21),('Dados de Entrada'!$B$30*10^3)*'Dados de Entrada'!$B$43*'Dados de Entrada'!$B$39,IF(AC$1<'Dados de Entrada'!$B$19+'Dados de Entrada'!$B$18,0,\"\"))","v":""},{"$f":"IF(AND(AD$1>='Dados de Entrada'!$B$19+'Dados de Entrada'!$B$18,AD$1<='Dados de Entrada'!$B$21),('Dados de Entrada'!$B$30*10^3)*'Dados de Entrada'!$B$43*'Dados de Entrada'!$B$39,IF(AD$1<'Dados de Entrada'!$B$19+'Dados de Entrada'!$B$18,0,\"\"))","v":""},{"$f":"IF(AND(AE$1>='Dados de Entrada'!$B$19+'Dados de Entrada'!$B$18,AE$1<='Dados de Entrada'!$B$21),('Dados de Entrada'!$B$30*10^3)*'Dados de Entrada'!$B$43*'Dados de Entrada'!$B$39,IF(AE$1<'Dados de Entrada'!$B$19+'Dados de Entrada'!$B$18,0,\"\"))","v":""},{"$f":"IF(AND(AF$1>='Dados de Entrada'!$B$19+'Dados de Entrada'!$B$18,AF$1<='Dados de Entrada'!$B$21),('Dados de Entrada'!$B$30*10^3)*'Dados de Entrada'!$B$43*'Dados de Entrada'!$B$39,IF(AF$1<'Dados de Entrada'!$B$19+'Dados de Entrada'!$B$18,0,\"\"))","v":""},{"$f":"IF(AND(AG$1>='Dados de Entrada'!$B$19+'Dados de Entrada'!$B$18,AG$1<='Dados de Entrada'!$B$21),('Dados de Entrada'!$B$30*10^3)*'Dados de Entrada'!$B$43*'Dados de Entrada'!$B$39,IF(AG$1<'Dados de Entrada'!$B$19+'Dados de Entrada'!$B$18,0,\"\"))","v":""},{"$f":"IF(AND(AH$1>='Dados de Entrada'!$B$19+'Dados de Entrada'!$B$18,AH$1<='Dados de Entrada'!$B$21),('Dados de Entrada'!$B$30*10^3)*'Dados de Entrada'!$B$43*'Dados de Entrada'!$B$39,IF(AH$1<'Dados de Entrada'!$B$19+'Dados de Entrada'!$B$18,0,\"\"))","v":""},{"$f":"IF(AND(AI$1>='Dados de Entrada'!$B$19+'Dados de Entrada'!$B$18,AI$1<='Dados de Entrada'!$B$21),('Dados de Entrada'!$B$30*10^3)*'Dados de Entrada'!$B$43*'Dados de Entrada'!$B$39,IF(AI$1<'Dados de Entrada'!$B$19+'Dados de Entrada'!$B$18,0,\"\"))","v":""},{"$f":"IF(AND(AJ$1>='Dados de Entrada'!$B$19+'Dados de Entrada'!$B$18,AJ$1<='Dados de Entrada'!$B$21),('Dados de Entrada'!$B$30*10^3)*'Dados de Entrada'!$B$43*'Dados de Entrada'!$B$39,IF(AJ$1<'Dados de Entrada'!$B$19+'Dados de Entrada'!$B$18,0,\"\"))","v":""},{"$f":"IF(AND(AK$1>='Dados de Entrada'!$B$19+'Dados de Entrada'!$B$18,AK$1<='Dados de Entrada'!$B$21),('Dados de Entrada'!$B$30*10^3)*'Dados de Entrada'!$B$43*'Dados de Entrada'!$B$39,IF(AK$1<'Dados de Entrada'!$B$19+'Dados de Entrada'!$B$18,0,\"\"))","v":""},{"$f":"IF(AND(AL$1>='Dados de Entrada'!$B$19+'Dados de Entrada'!$B$18,AL$1<='Dados de Entrada'!$B$21),('Dados de Entrada'!$B$30*10^3)*'Dados de Entrada'!$B$43*'Dados de Entrada'!$B$39,IF(AL$1<'Dados de Entrada'!$B$19+'Dados de Entrada'!$B$18,0,\"\"))","v":""},{"$f":"IF(AND(AM$1>='Dados de Entrada'!$B$19+'Dados de Entrada'!$B$18,AM$1<='Dados de Entrada'!$B$21),('Dados de Entrada'!$B$30*10^3)*'Dados de Entrada'!$B$43*'Dados de Entrada'!$B$39,IF(AM$1<'Dados de Entrada'!$B$19+'Dados de Entrada'!$B$18,0,\"\"))","v":""},{"$f":"IF(AND(AN$1>='Dados de Entrada'!$B$19+'Dados de Entrada'!$B$18,AN$1<='Dados de Entrada'!$B$21),('Dados de Entrada'!$B$30*10^3)*'Dados de Entrada'!$B$43*'Dados de Entrada'!$B$39,IF(AN$1<'Dados de Entrada'!$B$19+'Dados de Entrada'!$B$18,0,\"\"))","v":""},{"$f":"IF(AND(AO$1>='Dados de Entrada'!$B$19+'Dados de Entrada'!$B$18,AO$1<='Dados de Entrada'!$B$21),('Dados de Entrada'!$B$30*10^3)*'Dados de Entrada'!$B$43*'Dados de Entrada'!$B$39,IF(AO$1<'Dados de Entrada'!$B$19+'Dados de Entrada'!$B$18,0,\"\"))","v":""}]
["Opex associado a Outros custos operacionais (2.1.4)",{"$f":"IF(AND(B$1>='Dados de Entrada'!$B$19+'Dados de Entrada'!$B$18,B$1<='Dados de Entrada'!$B$21),'Dados de Entrada'!$B$45*'Dados de Entrada'!$B$35,IF(B$1<'Dados de Entrada'!$B$19+'Dados de Entrada'!$B$18,0,\"\"))","v":0},{"$f":"IF(AND(C$1>='Dados de Entrada'!$B$19+'Dados de Entrada'!$B$18,C$1<='Dados de Entrada'!$B$21),'Dados de Entrada'!$B$45*'Dados de Entrada'!$B$35,IF(C$1<'Dados de Entrada'!$B$19+'Dados de Entrada'!$B$18,0,\"\"))","v":0},{"$f":"IF(AND(D$1>='Dados de Entrada'!$B$19+'Dados de Entrada'!$B$18,D$1<='Dados de Entrada'!$B$21),'Dados de Entrada'!$B$45*'Dados de Entrada'!$B$35,IF(D$1<'Dados de Entrada'!$B$19+'Dados de Entrada'!$B$18,0,\"\"))","v":284239.7974342599},{"$f":"IF(AND(E$1>='Dados de Entrada'!$B$19+'Dados de Entrada'!$B$18,E$1<='Dados de Entrada'!$B$21),'Dados de Entrada'!$B$45*'Dados de Entrada'!$B$35,IF(E$1<'Dados de Entrada'!$B$19+'Dados de Entrada'!$B$18,0,\"\"))","v":284239.7974342599},{"$f":"IF(AND(F$1>='Dados de Entrada'!$B$19+'Dados de Entrada'!$B$18,F$1<='Dados de Entrada'!$B$21),'Dados de Entrada'!$B$45*'Dados de Entrada'!$B$35,IF(F$1<'Dados de Entrada'!$B$19+'Dados de Entrada'!$B$18,0,\"\"))","v":284239.7974342599},{"$f":"IF(AND(G$1>='Dados de Entrada'!$B$19+'Dados de Entrada'!$B$18,G$1<='Dados de Entrada'!$B$21),'Dados de Entrada'!$B$45*'Dados de Entrada'!$B$35,IF(G$1<'Dados de Entrada'!$B$19+'Dados de Entrada'!$B$18,0,\"\"))","v":284239.7974342599},{"$f":"IF(AND(H$1>='Dados de Entrada'!$B$19+'Dados de Entrada'!$B$18,H$1<='Dados de Entrada'!$B$21),'Dados de Entrada'!$B$45*'Dados de Entrada'!$B$35,IF(H$1<'Dados de Entrada'!$B$19+'Dados de Entrada'!$B$18,0,\"\"))","v":284239.7974342599},{"$f":"IF(AND(I$1>='Dados de Entrada'!$B$19+'Dados de Entrada'!$B$18,I$1<='Dados de Entrada'!$B$21),'Dados de Entrada'!$B$45*'Dados de Entrada'!$B$35,IF(I$1<'Dados de Entrada'!$B$19+'Dados de Entrada'!$B$18,0,\"\"))","v":284239.7974342599},{"$f":"IF(AND(J$1>='Dados de Entrada'!$B$19+'Dados de Entrada'!$B$18,J$1<='Dados de Entrada'!$B$21),'Dados de Entrada'!$B$45*'Dados de Entrada'!$B$35,IF(J$1<'Dados de Entrada'!$B$19+'Dados de Entrada'!$B$18,0,\"\"))","v":284239.7974342599},{"$f":"IF(AND(K$1>='Dados de Entrada'!$B$19+'Dados de Entrada'!$B$18,K$1<='Dados de Entrada'!$B$21),'Dados de Entrada'!$B$45*'Dados de Entrada'!$B$35,IF(K$1<'Dados de Entrada'!$B$19+'Dados de Entrada'!$B$18,0,\"\"))","v":284239.7974342599},{"$f":"IF(AND(L$1>='Dados de Entrada'!$B$19+'Dados de Entrada'!$B$18,L$1<='Dados de Entrada'!$B$21),'Dados de Entrada'!$B$45*'Dados de Entrada'!$B$35,IF(L$1<'Dados de Entrada'!$B$19+'Dados de Entrada'!$B$18,0,\"\"))","v":284239.7974342599},{"$f":"IF(AND(M$1>='Dados de Entrada'!$B$19+'Dados de Entrada'!$B$18,M$1<='Dados de Entrada'!$B$21),'Dados de Entrada'!$B$45*'Dados de Entrada'!$B$35,IF(M$1<'Dados de Entrada'!$B$19+'Dados de Entrada'!$B$18,0,\"\"))","v":284239.7974342599},{"$f":"IF(AND(N$1>='Dados de Entrada'!$B$19+'Dados de Entrada'!$B$18,N$1<='Dados de Entrada'!$B$21),'Dados de Entrada'!$B$45*'Dados de Entrada'!$B$35,IF(N$1<'Dados de Entrada'!$B$19+'Dados de Entrada'!$B$18,0,\"\"))","v":284239.7974342599},{"$f":"IF(AND(O$1>='Dados de Entrada'!$B$19+'Dados de Entrada'!$B$18,O$1<='Dados de Entrada'!$B$21),'Dados de Entrada'!$B$45*'Dados de Entrada'!$B$35,IF(O$1<'Dados de Entrada'!$B$19+'Dados de Entrada'!$B$18,0,\"\"))","v":284239.7974342599},{"$f":"IF(AND(P$1>='Dados de Entrada'!$B$19+'Dados de Entrada'!$B$18,P$1<='Dados de Entrada'!$B$21),'Dados de Entrada'!$B$45*'Dados de Entrada'!$B$35,IF(P$1<'Dados de Entrada'!$B$19+'Dados de Entrada'!$B$18,0,\"\"))","v":284239.7974342599},{"$f":"IF(AND(Q$1>='Dados de Entrada'!$B$19+'Dados de Entrada'!$B$18,Q$1<='Dados de Entrada'!$B$21),'Dados de Entrada'!$B$45*'Dados de Entrada'!$B$35,IF(Q$1<'Dados de Entrada'!$B$19+'Dados de Entrada'!$B$18,0,\"\"))","v":284239.7974342599},{"$f":"IF(AND(R$1>='Dados de Entrada'!$B$19+'Dados de Entrada'!$B$18,R$1<='Dados de Entrada'!$B$21),'Dados de Entrada'!$B$45*'Dados de Entrada'!$B$35,IF(R$1<'Dados de Entrada'!$B$19+'Dados de Entrada'!$B$18,0,\"\"))","v":284239.7974342599},{"$f":"IF(AND(S$1>='Dados de Entrada'!$B$19+'Dados de Entrada'!$B$18,S$1<='Dados de Entrada'!$B$21),'Dados de Entrada'!$B$45*'Dados de Entrada'!$B$35,IF(S$1<'Dados de Entrada'!$B$19+'Dados de Entrada'!$B$18,0,\"\"))","v":284239.7974342599},{"$f":"IF(AND(T$1>='Dados de Entrada'!$B$19+'Dados de Entrada'!$B$18,T$1<='Dados de Entrada'!$B$21),'Dados de Entrada'!$B$45*'Dados de Entrada'!$B$35,IF(T$1<'Dados de Entrada'!$B$19+'Dados de Entrada'!$B$18,0,\"\"))","v":284239.7974342599},{"$f":"IF(AND(U$1>='Dados de Entrada'!$B$19+'Dados de Entrada'!$B$18,U$1<='Dados de Entrada'!$B$21),'Dados de Entrada'!$B$45*'Dados de Entrada'!$B$35,IF(U$1<'Dados de Entrada'!$B$19+'Dados de Entrada'!$B$18,0,\"\"))","v":284239.7974342599},{"$f":"IF(AND(V$1>='Dados de Entrada'!$B$19+'Dados de Entrada'!$B$18,V$1<='Dados de Entrada'!$B$21),'Dados de Entrada'!$B$45*'Dados de Entrada'!$B$35,IF(V$1<'Dados de Entrada'!$B$19+'Dados de Entrada'!$B$18,0,\"\"))","v":284239.7974342599},{"$f":"IF(AND(W$1>='Dados de Entrada'!$B$19+'Dados de Entrada'!$B$18,W$1<='Dados de Entrada'!$B$21),'Dados de Entrada'!$B$45*'Dados de Entrada'!$B$35,IF(W$1<'Dados de Entrada'!$B$19+'Dados de Entrada'!$B$18,0,\"\"))","v":284239.7974342599},{"$f":"IF(AND(X$1>='Dados de Entrada'!$B$19+'Dados de Entrada'!$B$18,X$1<='Dados de Entrada'!$B$21),'Dados de Entrada'!$B$45*'Dados de Entrada'!$B$35,IF(X$1<'Dados de Entrada'!$B$19+'Dados de Entrada'!$B$18,0,\"\"))","v":""},{"$f":"IF(AND(Y$1>='Dados de Entrada'!$B$19+'Dados de Entrada'!$B$18,Y$1<='Dados de Entrada'!$B$21),'Dados de Entrada'!$B$45*'Dados de Entrada'!$B$35,IF(Y$1<'Dados de Entrada'!$B$19+'Dados de Entrada'!$B$18,0,\"\"))","v":""},{"$f":"IF(AND(Z$1>='Dados de Entrada'!$B$19+'Dados de Entrada'!$B$18,Z$1<='Dados de Entrada'!$B$21),'Dados de Entrada'!$B$45*'Dados de Entrada'!$B$35,IF(Z$1<'Dados de Entrada'!$B$19+'Dados de Entrada'!$B$18,0,\"\"))","v":""},{"$f":"IF(AND(AA$1>='Dados de Entrada'!$B$19+'Dados de Entrada'!$B$18,AA$1<='Dados de Entrada'!$B$21),'Dados de Entrada'!$B$45*'Dados de Entrada'!$B$35,IF(AA$1<'Dados de Entrada'!$B$19+'Dados de Entrada'!$B$18,0,\"\"))","v":""},{"$f":"IF(AND(AB$1>='Dados de Entrada'!$B$19+'Dados de Entrada'!$B$18,AB$1<='Dados de Entrada'!$B$21),'Dados de Entrada'!$B$45*'Dados de Entrada'!$B$35,IF(AB$1<'Dados de Entrada'!$B$19+'Dados de Entrada'!$B$18,0,\"\"))","v":""},{"$f":"IF(AND(AC$1>='Dados de Entrada'!$B$19+'Dados de Entrada'!$B$18,AC$1<='Dados de Entrada'!$B$21),'Dados de Entrada'!$B$45*'Dados de Entrada'!$B$35,IF(AC$1<'Dados de Entrada'!$B$19+'Dados de Entrada'!$B$18,0,\"\"))","v":""},{"$f":"IF(AND(AD$1>='Dados de Entrada'!$B$19+'Dados de Entrada'!$B$18,AD$1<='Dados de Entrada'!$B$21),'Dados de Entrada'!$B$45*'Dados de Entrada'!$B$35,IF(AD$1<'Dados de Entrada'!$B$19+'Dados de Entrada'!$B$18,0,\"\"))","v":""},{"$f":"IF(AND(AE$1>='Dados de Entrada'!$B$19+'Dados de Entrada'!$B$18,AE$1<='Dados de Entrada'!$B$21),'Dados de Entrada'!$B$45*'Dados de Entrada'!$B$35,IF(AE$1<'Dados de Entrada'!$B$19+'Dados de Entrada'!$B$18,0,\"\"))","v":""},{"$f":"IF(AND(AF$1>='Dados de Entrada'!$B$19+'Dados de Entrada'!$B$18,AF$1<='Dados de Entrada'!$B$21),'Dados de Entrada'!$B$45*'Dados de Entrada'!$B$35,IF(AF$1<'Dados de Entrada'!$B$19+'Dados de Entrada'!$B$18,0,\"\"))","v":""},{"$f":"IF(AND(AG$1>='Dados de Entrada'!$B$19+'Dados de Entrada'!$B$18,AG$1<='Dados de Entrada'!$B$21),'Dados de Entrada'!$B$45*'Dados de Entrada'!$B$35,IF(AG$1<'Dados de Entrada'!$B$19+'Dados de Entrada'!$B$18,0,\"\"))","v":""},{"$f":"IF(AND(AH$1>='Dados de Entrada'!$B$19+'Dados de Entrada'!$B$18,AH$1<='Dados de Entrada'!$B$21),'Dados de Entrada'!$B$45*'Dados de Entrada'!$B$35,IF(AH$1<'Dados de Entrada'!$B$19+'Dados de Entrada'!$B$18,0,\"\"))","v":""},{"$f":"IF(AND(AI$1>='Dados de Entrada'!$B$19+'Dados de Entrada'!$B$18,AI$1<='Dados de Entrada'!$B$21),'Dados de Entrada'!$B$45*'Dados de Entrada'!$B$35,IF(AI$1<'Dados de Entrada'!$B$19+'Dados de Entrada'!$B$18,0,\"\"))","v":""},{"$f":"IF(AND(AJ$1>='Dados de Entrada'!$B$19+'Dados de Entrada'!$B$18,AJ$1<='Dados de Entrada'!$B$21),'Dados de Entrada'!$B$45*'Dados de Entrada'!$B$35,IF(AJ$1<'Dados de Entrada'!$B$19+'Dados de Entrada'!$B$18,0,\"\"))","v":""},{"$f":"IF(AND(AK$1>='Dados de Entrada'!$B$19+'Dados de Entrada'!$B$18,AK$1<='Dados de Entrada'!$B$21),'Dados de Entrada'!$B$45*'Dados de Entrada'!$B$35,IF(AK$1<'Dados de Entrada'!$B$19+'Dados de Entrada'!$B$18,0,\"\"))","v":""},{"$f":"IF(AND(AL$1>='Dados de Entrada'!$B$19+'Dados de Entrada'!$B$18,AL$1<='Dados de Entrada'!$B$21),'Dados de Entrada'!$B$45*'Dados de Entrada'!$B$35,IF(AL$1<'Dados de Entrada'!$B$19+'Dados de Entrada'!$B$18,0,\"\"))","v":""},{"$f":"IF(AND(AM$1>='Dados de Entrada'!$B$19+'Dados de Entrada'!$B$18,AM$1<='Dados de Entrada'!$B$21),'Dados de Entrada'!$B$45*'Dados de Entrada'!$B$35,IF(AM$1<'Dados de Entrada'!$B$19+'Dados de Entrada'!$B$18,0,\"\"))","v":""},{"$f":"IF(AND(AN$1>='Dados de Entrada'!$B$19+'Dados de Entrada'!$B$18,AN$1<='Dados de Entrada'!$B$21),'Dados de Entrada'!$B$45*'Dados de Entrada'!$B$35,IF(AN$1<'Dados de Entrada'!$B$19+'Dados de Entrada'!$B$18,0,\"\"))","v":""},{"$f":"IF(AND(AO$1>='Dados de Entrada'!$B$19+'Dados de Entrada'!$B$18,AO$1<='Dados de Entrada'!$B$21),'Dados de Entrada'!$B$45*'Dados de Entrada'!$B$35,IF(AO$1<'Dados de Entrada'!$B$19+'Dados de Entrada'!$B$18,0,\"\"))","v":""}]
["Opex do CCS (2.2) = (2.2.1) + (2.2.2) + (2.2.3)",{"$f":"IF(AND(B$1>='Dados de Entrada'!$B$19+'Dados de Entrada'!$B$18,B$1<='Dados de Entrada'!$B$21),B11+B15,IF(B$1<'Dados de Entrada'!$B$19+'Dados de Entrada'!$B$18,0,\"\"))","v":0},{"$f":"IF(AND(C$1>='Dados de Entrada'!$B$19+'Dados de Entrada'!$B$18,C$1<='Dados de Entrada'!$B$21),C11+C15,IF(C$1<'Dados de Entrada'!$B$19+'Dados de Entrada'!$B$18,0,\"\"))","v":0},{"$f":"IF(AND(D$1>='Dados de Entrada'!$B$19+'Dados de Entrada'!$B$18,D$1<='Dados de Entrada'!$B$21),D11+D15,IF(D$1<'Dados de Entrada'!$B$19+'Dados de Entrada'!$B$18,0,\"\"))","v":0},{"$f":"IF(AND(E$1>='Dados de Entrada'!$B$19+'Dados de Entrada'!$B$18,E$1<='Dados de Entrada'!$B$21),E11+E15,IF(E$1<'Dados de Entrada'!$B$19+'Dados de Entrada'!$B$18,0,\"\"))","v":0},{"$f":"IF(AND(F$1>='Dados de Entrada'!$B$19+'Dados de Entrada'!$B$18,F$1<='Dados de Entrada'!$B$21),F11+F15,IF(F$1<'Dados de Entrada'!$B$19+'Dados de Entrada'!$B$18,0,\"\"))","v":0},{"$f":"IF(AND(G$1>='Dados de Entrada'!$B$19+'Dados de Entrada'!$B$18,G$1<='Dados de Entrada'!$B$21),G11+G15,IF(G$1<'Dados de Entrada'!$B$19+'Dados de Entrada'!$B$18,0,\"\"))","v":0},{"$f":"IF(AND(H$1>='Dados de Entrada'!$B$19+'Dados de Entrada'!$B$18,H$1<='Dados de Entrada'!$B$21),H11+H15,IF(H$1<'Dados de Entrada'!$B$19+'Dados de Entrada'!$B$18,0,\"\"))","v":0},{"$f":"IF(AND(I$1>='Dados de Entrada'!$B$19+'Dados de Entrada'!$B$18,I$1<='Dados de Entrada'!$B$21),I11+I15,IF(I$1<'Dados de Entrada'!$B$19+'Dados de Entrada'!$B$18,0,\"\"))","v":0},{"$f":"IF(AND(J$1>='Dados de Entrada'!$B$19+'Dados de Entrada'!$B$18,J$1<='Dados de Entrada'!$B$21),J11+J15,IF(J$1<'Dados de Entrada'!$B$19+'Dados de Entrada'!$B$18,0,\"\"))","v":0},{"$f":"IF(AND(K$1>='Dados de Entrada'!$B$19+'Dados de Entrada'!$B$18,K$1<='Dados de Entrada'!$B$21),K11+K15,IF(K$1<'Dados de Entrada'!$B$19+'Dados de Entrada'!$B$18,0,\"\"))","v":0},{"$f":"IF(AND(L$1>='Dados de Entrada'!$B$19+'Dados de Entrada'!$B$18,L$1<='Dados de Entrada'!$B$21),L11+L15,IF(L$1<'Dados de Entrada'!$B$19+'Dados de Entrada'!$B$18,0,\"\"))","v":0},{"$f":"IF(AND(M$1>='Dados de Entrada'!$B$19+'Dados de Entrada'!$B$18,M$1<='Dados de Entrada'!$B$21),M11+M15,IF(M$1<'Dados de Entrada'!$B$19+'Dados de Entrada'!$B$18,0,\"\"))","v":0},{"$f":"IF(AND(N$1>='Dados de Entrada'!$B$19+'Dados de Entrada'!$B$18,N$1<='Dados de Entrada'!$B$21),N11+N15,IF(N$1<'Dados de Entrada'!$B$19+'Dados de Entrada'!$B$18,0,\"\"))","v":0},{"$f":"IF(AND(O$1>='Dados de Entrada'!$B$19+'Dados de Entrada'!$B$18,O$1<='Dados de Entrada'!$B$21),O11+O15,IF(O$1<'Dados de Entrada'!$B$19+'Dados de Entrada'!$B$18,0,\"\"))","v":0},{"$f":"IF(AND(P$1>='Dados de Entrada'!$B$19+'Dados de Entrada'!$B$18,P$1<='Dados de Entrada'!$B$21),P11+P15,IF(P$1<'Dados de Entrada'!$B$19+'Dados de Entrada'!$B$18,0,\"\"))","v":0},{"$f":"IF(AND(Q$1>='Dados de Entrada'!$B$19+'Dados de Entrada'!$B$18,Q$1<='Dados de Entrada'!$B$21),Q11+Q15,IF(Q$1<'Dados de Entrada'!$B$19+'Dados de Entrada'!$B$18,0,\"\"))","v":0},{"$f":"IF(AND(R$1>='Dados de Entrada'!$B$19+'Dados de Entrada'!$B$18,R$1<='Dados de Entrada'!$B$21),R11+R15,IF(R$1<'Dados de Entrada'!$B$19+'Dados de Entrada'!$B$18,0,\"\"))","v":0},{"$f":"IF(AND(S$1>='Dados de Entrada'!$B$19+'Dados de Entrada'!$B$18,S$1<='Dados de Entrada'!$B$21),S11+S15,IF(S$1<'Dados de Entrada'!$B$19+'Dados de Entrada'!$B$18,0,\"\"))","v":0},{"$f":"IF(AND(T$1>='Dados de Entrada'!$B$19+'Dados de Entrada'!$B$18,T$1<='Dados de Entrada'!$B$21),T11+T15,IF(T$1<'Dados de Entrada'!$B$19+'Dados de Entrada'!$B$18,0,\"\"))","v":0},{"$f":"IF(AND(U$1>='Dados de Entrada'!$B$19+'Dados de Entrada'!$B$18,U$1<='Dados de Entrada'!$B$21),U11+U15,IF(U$1<'Dados de Entrada'!$B$19+'Dados de Entrada'!$B$18,0,\"\"))","v":0},{"$f":"IF(AND(V$1>='Dados de Entrada'!$B$19+'Dados de Entrada'!$B$18,V$1<='Dados de Entrada'!$B$21),V11+V15,IF(V$1<'Dados de Entrada'!$B$19+'Dados de Entrada'!$B$18,0,\"\"))","v":0},{"$f":"IF(AND(W$1>='Dados de Entrada'!$B$19+'Dados de Entrada'!$B$18,W$1<='Dados de Entrada'!$B$21),W11+W15,IF(W$1<'Dados de Entrada'!$B$19+'Dados de Entrada'!$B$18,0,\"\"))","v":0},{"$f":"IF(AND(X$1>='Dados de Entrada'!$B$19+'Dados de Entrada'!$B$18,X$1<='Dados de Entrada'!$B$21),X11+X15,IF(X$1<'Dados de Entrada'!$B$19+'Dados de Entrada'!$B$18,0,\"\"))","v":""},{"$f":"IF(AND(Y$1>='Dados de Entrada'!$B$19+'Dados de Entrada'!$B$18,Y$1<='Dados de Entrada'!$B$21),Y11+Y15,IF(Y$1<'Dados de Entrada'!$B$19+'Dados de Entrada'!$B$18,0,\"\"))","v":""},{"$f":"IF(AND(Z$1>='Dados de Entrada'!$B$19+'Dados de Entrada'!$B$18,Z$1<='Dados de Entrada'!$B$21),Z11+Z15,IF(Z$1<'Dados de Entrada'!$B$19+'Dados de Entrada'!$B$18,0,\"\"))","v":""},{"$f":"IF(AND(AA$1>='Dados de Entrada'!$B$19+'Dados de Entrada'!$B$18,AA$1<='Dados de Entrada'!$B$21),AA11+AA15,IF(AA$1<'Dados de Entrada'!$B$19+'Dados de Entrada'!$B$18,0,\"\"))","v":""},{"$f":"IF(AND(AB$1>='Dados de Entrada'!$B$19+'Dados de Entrada'!$B$18,AB$1<='Dados de Entrada'!$B$21),AB11+AB15,IF(AB$1<'Dados de Entrada'!$B$19+'Dados de Entrada'!$B$18,0,\"\"))","v":""},{"$f":"IF(AND(AC$1>='Dados de Entrada'!$B$19+'Dados de Entrada'!$B$18,AC$1<='Dados de Entrada'!$B$21),AC11+AC15,IF(AC$1<'Dados de Entrada'!$B$19+'Dados de Entrada'!$B$18,0,\"\"))","v":""},{"$f":"IF(AND(AD$1>='Dados de Entrada'!$B$19+'Dados de Entrada'!$B$18,AD$1<='Dados de Entrada'!$B$21),AD11+AD15,IF(AD$1<'Dados de Entrada'!$B$19+'Dados de Entrada'!$B$18,0,\"\"))","v":""},{"$f":"IF(AND(AE$1>='Dados de Entrada'!$B$19+'Dados de Entrada'!$B$18,AE$1<='Dados de Entrada'!$B$21),AE11+AE15,IF(AE$1<'Dados de Entrada'!$B$19+'Dados de Entrada'!$B$18,0,\"\"))","v":""},{"$f":"IF(AND(AF$1>='Dados de Entrada'!$B$19+'Dados de Entrada'!$B$18,AF$1<='Dados de Entrada'!$B$21),AF11+AF15,IF(AF$1<'Dados de Entrada'!$B$19+'Dados de Entrada'!$B$18,0,\"\"))","v":""},{"$f":"IF(AND(AG$1>='Dados de Entrada'!$B$19+'Dados de Entrada'!$B$18,AG$1<='Dados de Entrada'!$B$21),AG11+AG15,IF(AG$1<'Dados de Entrada'!$B$19+'Dados de Entrada'!$B$18,0,\"\"))","v":""},{"$f":"IF(AND(AH$1>='Dados de Entrada'!$B$19+'Dados de Entrada'!$B$18,AH$1<='Dados de Entrada'!$B$21),AH11+AH15,IF(AH$1<'Dados de Entrada'!$B$19+'Dados de Entrada'!$B$18,0,\"\"))","v":""},{"$f":"IF(AND(AI$1>='Dados de Entrada'!$B$19+'Dados de Entrada'!$B$18,AI$1<='Dados de Entrada'!$B$21),AI11+AI15,IF(AI$1<'Dados de Entrada'!$B$19+'Dados de Entrada'!$B$18,0,\"\"))","v":""},{"$f":"IF(AND(AJ$1>='Dados de Entrada'!$B$19+'Dados de Entrada'!$B$18,AJ$1<='Dados de Entrada'!$B$21),AJ11+AJ15,IF(AJ$1<'Dados de Entrada'!$B$19+'Dados de Entrada'!$B$18,0,\"\"))","v":""},{"$f":"IF(AND(AK$1>='Dados de Entrada'!$B$19+'Dados de Entrada'!$B$18,AK$1<='Dados de Entrada'!$B$21),AK11+AK15,IF(AK$1<'Dados de Entrada'!$B$19+'Dados de Entrada'!$B$18,0,\"\"))","v":""},{"$f":"IF(AND(AL$1>='Dados de Entrada'!$B$19+'Dados de Entrada'!$B$18,AL$1<='Dados de Entrada'!$B$21),AL11+AL15,IF(AL$1<'Dados de Entrada'!$B$19+'Dados de Entrada'!$B$18,0,\"\"))","v":""},{"$f":"IF(AND(AM$1>='Dados de Entrada'!$B$19+'Dados de Entrada'!$B$18,AM$1<='Dados de Entrada'!$B$21),AM11+AM15,IF(AM$1<'Dados de Entrada'!$B$19+'Dados de Entrada'!$B$18,0,\"\"))","v":""},{"$f":"IF(AND(AN$1>='Dados de Entrada'!$B$19+'Dados de Entrada'!$B$18,AN$1<='Dados de Entrada'!$B$21),AN11+AN15,IF(AN$1<'Dados de Entrada'!$B$19+'Dados de Entrada'!$B$18,0,\"\"))","v":""},{"$f":"IF(AND(AO$1>='Dados de Entrada'!$B$19+'Dados de Entrada'!$B$18,AO$1<='Dados de Entrada'!$B$21),AO11+AO15,IF(AO$1<'Dados de Entrada'!$B$19+'Dados de Entrada'!$B$18,0,\"\"))","v":""}]
["Opex da Captura de CO2 (2.2.1) = (2.2.1.1) + (2.2.1.2) + (2.2.1.3)",{"$f":"IF(AND(B$1>='Dados de Entrada'!$B$19+'Dados de Entrada'!$B$18,B$1<='Dados de Entrada'!$B$21),SUM(B12:B14),IF(B$1<'Dados de Entrada'!$B$19+'Dados de Entrada'!$B$18,0,\"\"))","v":0},{"$f":"IF(AND(C$1>='Dados de Entrada'!$B$19+'Dados de Entrada'!$B$18,C$1<='Dados de Entrada'!$B$21),SUM(C12:C14),IF(C$1<'Dados de Entrada'!$B$19+'Dados de Entrada'!$B$18,0,\"\"))","v":0},{"$f":"IF(AND(D$1>='Dados de Entrada'!$B$19+'Dados de Entrada'!$B$18,D$1<='Dados de Entrada'!$B$21),SUM(D12:D14),IF(D$1<'Dados de Entrada'!$B$19+'Dados de Entrada'!$B$18,0,\"\"))","v":0},{"$f":"IF(AND(E$1>='Dados de Entrada'!$B$19+'Dados de Entrada'!$B$18,E$1<='Dados de Entrada'!$B$21),SUM(E12:E14),IF(E$1<'Dados de Entrada'!$B$19+'Dados de Entrada'!$B$18,0,\"\"))","v":0},{"$f":"IF(AND(F$1>='Dados de Entrada'!$B$19+'Dados de Entrada'!$B$18,F$1<='Dados de Entrada'!$B$21),SUM(F12:F14),IF(F$1<'Dados de Entrada'!$B$19+'Dados de Entrada'!$B$18,0,\"\"))","v":0},{"$f":"IF(AND(G$1>='Dados de Entrada'!$B$19+'Dados de Entrada'!$B$18,G$1<='Dados de Entrada'!$B$21),SUM(G12:G14),IF(G$1<'Dados de Entrada'!$B$19+'Dados de Entrada'!$B$18,0,\"\"))","v":0},{"$f":"IF(AND(H$1>='Dados de Entrada'!$B$19+'Dados de Entrada'!$B$18,H$1<='Dados de Entrada'!$B$21),SUM(H12:H14),IF(H$1<'Dados de Entrada'!$B$19+'Dados de Entrada'!$B$18,0,\"\"))","v":0},{"$f":"IF(AND(I$1>='Dados de Entrada'!$B$19+'Dados de Entrada'!$B$18,I$1<='Dados de Entrada'!$B$21),SUM(I12:I14),IF(I$1<'Dados de Entrada'!$B$19+'Dados de Entrada'!$B$18,0,\"\"))","v":0},{"$f":"IF(AND(J$1>='Dados de Entrada'!$B$19+'Dados de Entrada'!$B$18,J$1<='Dados de Entrada'!$B$21),SUM(J12:J14),IF(J$1<'Dados de Entrada'!$B$19+'Dados de Entrada'!$B$18,0,\"\"))","v":0},{"$f":"IF(AND(K$1>='Dados de Entrada'!$B$19+'Dados de Entrada'!$B$18,K$1<='Dados de Entrada'!$B$21),SUM(K12:K14),IF(K$1<'Dados de Entrada'!$B$19+'Dados de Entrada'!$B$18,0,\"\"))","v":0},{"$f":"IF(AND(L$1>='Dados de Entrada'!$B$19+'Dados de Entrada'!$B$18,L$1<='Dados de Entrada'!$B$21),SUM(L12:L14),IF(L$1<'Dados de Entrada'!$B$19+'Dados de Entrada'!$B$18,0,\"\"))","v":0},{"$f":"IF(AND(M$1>='Dados de Entrada'!$B$19+'Dados de Entrada'!$B$18,M$1<='Dados de Entrada'!$B$21),SUM(M12:M14),IF(M$1<'Dados de Entrada'!$B$19+'Dados de Entrada'!$B$18,0,\"\"))","v":0},{"$f":"IF(AND(N$1>='Dados de Entrada'!$B$19+'Dados de Entrada'!$B$18,N$1<='Dados de Entrada'!$B$21),SUM(N12:N14),IF(N$1<'Dados de Entrada'!$B$19+'Dados de Entrada'!$B$18,0,\"\"))","v":0},{"$f":"IF(AND(O$1>='Dados de Entrada'!$B$19+'Dados de Entrada'!$B$18,O$1<='Dados de Entrada'!$B$21),SUM(O12:O14),IF(O$1<'Dados de Entrada'!$B$19+'Dados de Entrada'!$B$18,0,\"\"))","v":0},{"$f":"IF(AND(P$1>='Dados de Entrada'!$B$19+'Dados de Entrada'!$B$18,P$1<='Dados de Entrada'!$B$21),SUM(P12:P14),IF(P$1<'Dados de Entrada'!$B$19+'Dados de Entrada'!$B$18,0,\"\"))","v":0},{"$f":"IF(AND(Q$1>='Dados de Entrada'!$B$19+'Dados de Entrada'!$B$18,Q$1<='Dados de Entrada'!$B$21),SUM(Q12:Q14),IF(Q$1<'Dados de Entrada'!$B$19+'Dados de Entrada'!$B$18,0,\"\"))","v":0},{"$f":"IF(AND(R$1>='Dados de Entrada'!$B$19+'Dados de Entrada'!$B$18,R$1<='Dados de Entrada'!$B$21),SUM(R12:R14),IF(R$1<'Dados de Entrada'!$B$19+'Dados de Entrada'!$B$18,0,\"\"))","v":0},{"$f":"IF(AND(S$1>='Dados de Entrada'!$B$19+'Dados de Entrada'!$B$18,S$1<='Dados de Entrada'!$B$21),SUM(S12:S14),IF(S$1<'Dados de Entrada'!$B$19+'Dados de Entrada'!$B$18,0,\"\"))","v":0},{"$f":"IF(AND(T$1>='Dados de Entrada'!$B$19+'Dados de Entrada'!$B$18,T$1<='Dados de Entrada'!$B$21),SUM(T12:T14),IF(T$1<'Dados de Entrada'!$B$19+'Dados de Entrada'!$B$18,0,\"\"))","v":0},{"$f":"IF(AND(U$1>='Dados de Entrada'!$B$19+'Dados de Entrada'!$B$18,U$1<='Dados de Entrada'!$B$21),SUM(U12:U14),IF(U$1<'Dados de Entrada'!$B$19+'Dados de Entrada'!$B$18,0,\"\"))","v":0},{"$f":"IF(AND(V$1>='Dados de Entrada'!$B$19+'Dados de Entrada'!$B$18,V$1<='Dados de Entrada'!$B$21),SUM(V12:V14),IF(V$1<'Dados de Entrada'!$B$19+'Dados de Entrada'!$B$18,0,\"\"))","v":0},{"$f":"IF(AND(W$1>='Dados de Entrada'!$B$19+'Dados de Entrada'!$B$18,W$1<='Dados de Entrada'!$B$21),SUM(W12:W14),IF(W$1<'Dados de Entrada'!$B$19+'Dados de Entrada'!$B$18,0,\"\"))","v":0},{"$f":"IF(AND(X$1>='Dados de Entrada'!$B$19+'Dados de Entrada'!$B$18,X$1<='Dados de Entrada'!$B$21),SUM(X12:X14),IF(X$1<'Dados de Entrada'!$B$19+'Dados de Entrada'!$B$18,0,\"\"))","v":""},{"$f":"IF(AND(Y$1>='Dados de Entrada'!$B$19+'Dados de Entrada'!$B$18,Y$1<='Dados de Entrada'!$B$21),SUM(Y12:Y14),IF(Y$1<'Dados de Entrada'!$B$19+'Dados de Entrada'!$B$18,0,\"\"))","v":""},{"$f":"IF(AND(Z$1>='Dados de Entrada'!$B$19+'Dados de Entrada'!$B$18,Z$1<='Dados de Entrada'!$B$21),SUM(Z12:Z14),IF(Z$1<'Dados de Entrada'!$B$19+'Dados de Entrada'!$B$18,0,\"\"))","v":""},{"$f":"IF(AND(AA$1>='Dados de Entrada'!$B$19+'Dados de Entrada'!$B$18,AA$1<='Dados de Entrada'!$B$21),SUM(AA12:AA14),IF(AA$1<'Dados de Entrada'!$B$19+'Dados de Entrada'!$B$18,0,\"\"))","v":""},{"$f":"IF(AND(AB$1>='Dados de Entrada'!$B$19+'Dados de Entrada'!$B$18,AB$1<='Dados de Entrada'!$B$21),SUM(AB12:AB14),IF(AB$1<'Dados de Entrada'!$B$19+'Dados de Entrada'!$B$18,0,\"\"))","v":""},{"$f":"IF(AND(AC$1>='Dados de Entrada'!$B$19+'Dados de Entrada'!$B$18,AC$1<='Dados de Entrada'!$B$21),SUM(AC12:AC14),IF(AC$1<'Dados de Entrada'!$B$19+'Dados de Entrada'!$B$18,0,\"\"))","v":""},{"$f":"IF(AND(AD$1>='Dados de Entrada'!$B$19+'Dados de Entrada'!$B$18,AD$1<='Dados de Entrada'!$B$21),SUM(AD12:AD14),IF(AD$1<'Dados de Entrada'!$B$19+'Dados de Entrada'!$B$18,0,\"\"))","v":""},{"$f":"IF(AND(AE$1>='Dados de Entrada'!$B$19+'Dados de Entrada'!$B$18,AE$1<='Dados de Entrada'!$B$21),SUM(AE12:AE14),IF(AE$1<'Dados de Entrada'!$B$19+'Dados de Entrada'!$B$18,0,\"\"))","v":""},{"$f":"IF(AND(AF$1>='Dados de Entrada'!$B$19+'Dados de Entrada'!$B$18,AF$1<='Dados de Entrada'!$B$21),SUM(AF12:AF14),IF(AF$1<'Dados de Entrada'!$B$19+'Dados de Entrada'!$B$18,0,\"\"))","v":""},{"$f":"IF(AND(AG$1>='Dados de Entrada'!$B$19+'Dados de Entrada'!$B$18,AG$1<='Dados de Entrada'!$B$21),SUM(AG12:AG14),IF(AG$1<'Dados de Entrada'!$B$19+'Dados de Entrada'!$B$18,0,\"\"))","v":""},{"$f":"IF(AND(AH$1>='Dados de Entrada'!$B$19+'Dados de Entrada'!$B$18,AH$1<='Dados de Entrada'!$B$21),SUM(AH12:AH14),IF(AH$1<'Dados de Entrada'!$B$19+'Dados de Entrada'!$B$18,0,\"\"))","v":""},{"$f":"IF(AND(AI$1>='Dados de Entrada'!$B$19+'Dados de Entrada'!$B$18,AI$1<='Dados de Entrada'!$B$21),SUM(AI12:AI14),IF(AI$1<'Dados de Entrada'!$B$19+'Dados de Entrada'!$B$18,0,\"\"))","v":""},{"$f":"IF(AND(AJ$1>='Dados de Entrada'!$B$19+'Dados de Entrada'!$B$18,AJ$1<='Dados de Entrada'!$B$21),SUM(AJ12:AJ14),IF(AJ$1<'Dados de Entrada'!$B$19+'Dados de Entrada'!$B$18,0,\"\"))","v":""},{"$f":"IF(AND(AK$1>='Dados de Entrada'!$B$19+'Dados de Entrada'!$B$18,AK$1<='Dados de Entrada'!$B$21),SUM(AK12:AK14),IF(AK$1<'Dados de Entrada'!$B$19+'Dados de Entrada'!$B$18,0,\"\"))","v":""},{"$f":"IF(AND(AL$1>='Dados de Entrada'!$B$19+'Dados de Entrada'!$B$18,AL$1<='Dados de Entrada'!$B$21),SUM(AL12:AL14),IF(AL$1<'Dados de Entrada'!$B$19+'Dados de Entrada'!$B$18,0,\"\"))","v":""},{"$f":"IF(AND(AM$1>='Dados de Entrada'!$B$19+'Dados de Entrada'!$B$18,AM$1<='Dados de Entrada'!$B$21),SUM(AM12:AM14),IF(AM$1<'Dados de Entrada'!$B$19+'Dados de Entrada'!$B$18,0,\"\"))","v":""},{"$f":"IF(AND(AN$1>='Dados de Entrada'!$B$19+'Dados de Entrada'!$B$18,AN$1<='Dados de Entrada'!$B$21),SUM(AN12:AN14),IF(AN$1<'Dados de Entrada'!$B$19+'Dados de Entrada'!$B$18,0,\"\"))","v":""},{"$f":"IF(AND(AO$1>='Dados de Entrada'!$B$19+'Dados de Entrada'!$B$18,AO$1<='Dados de Entrada'!$B$21),SUM(AO12:AO14),IF(AO$1<'Dados de Entrada'!$B$19+'Dados de Entrada'!$B$18,0,\"\"))","v":""}]
["Opex associado ao Gás Natural (2.2.1.1)",{"$f":"IF(AND(B$1>='Dados de Entrada'!$B$19+'Dados de Entrada'!$B$18,B$1<='Dados de Entrada'!$B$21),'Dados de Entrada'!$B$55*'Dados de Entrada'!$B$64*'Dados de Entrada'!$B$37,IF(B$1<'Dados de Entrada'!$B$19+'Dados de Entrada'!$B$18,0,\"\"))","v":0},{"$f":"IF(AND(C$1>='Dados de Entrada'!$B$19+'Dados de Entrada'!$B$18,C$1<='Dados de Entrada'!$B$21),'Dados de Entrada'!$B$55*'Dados de Entrada'!$B$64*'Dados de Entrada'!$B$37,IF(C$1<'Dados de Entrada'!$B$19+'Dados de Entrada'!$B$18,0,\"\"))","v":0},{"$f":"IF(AND(D$1>='Dados de Entrada'!$B$19+'Dados de Entrada'!$B$18,D$1<='Dados de Entrada'!$B$21),'Dados de Entrada'!$B$55*'Dados de Entrada'!$B$64*'Dados de Entrada'!$B$37,IF(D$1<'Dados de Entrada'!$B$19+'Dados de Entrada'!$B$18,0,\"\"))","v":0},{"$f":"IF(AND(E$1>='Dados de Entrada'!$B$19+'Dados de Entrada'!$B$18,E$1<='Dados de Entrada'!$B$21),'Dados de Entrada'!$B$55*'Dados de Entrada'!$B$64*'Dados de Entrada'!$B$37,IF(E$1<'Dados de Entrada'!$B$19+'Dados de Entrada'!$B$18,0,\"\"))","v":0},{"$f":"IF(AND(F$1>='Dados de Entrada'!$B$19+'Dados de Entrada'!$B$18,F$1<='Dados de Entrada'!$B$21),'Dados de Entrada'!$B$55*'Dados de Entrada'!$B$64*'Dados de Entrada'!$B$37,IF(F$1<'Dados de Entrada'!$B$19+'Dados de Entrada'!$B$18,0,\"\"))","v":0},{"$f":"IF(AND(G$1>='Dados de Entrada'!$B$19+'Dados de Entrada'!$B$18,G$1<='Dados de Entrada'!$B$21),'Dados de Entrada'!$B$55*'Dados de Entrada'!$B$64*'Dados de Entrada'!$B$37,IF(G$1<'Dados de Entrada'!$B$19+'Dados de Entrada'!$B$18,0,\"\"))","v":0},{"$f":"IF(AND(H$1>='Dados de Entrada'!$B$19+'Dados de Entrada'!$B$18,H$1<='Dados de Entrada'!$B$21),'Dados de Entrada'!$B$55*'Dados de Entrada'!$B$64*'Dados de Entrada'!$B$37,IF(H$1<'Dados de Entrada'!$B$19+'Dados de Entrada'!$B$18,0,\"\"))","v":0},{"$f":"IF(AND(I$1>='Dados de Entrada'!$B$19+'Dados de Entrada'!$B$18,I$1<='Dados de Entrada'!$B$21),'Dados de Entrada'!$B$55*'Dados de Entrada'!$B$64*'Dados de Entrada'!$B$37,IF(I$1<'Dados de Entrada'!$B$19+'Dados de Entrada'!$B$18,0,\"\"))","v":0},{"$f":"IF(AND(J$1>='Dados de Entrada'!$B$19+'Dados de Entrada'!$B$18,J$1<='Dados de Entrada'!$B$21),'Dados de Entrada'!$B$55*'Dados de Entrada'!$B$64*'Dados de Entrada'!$B$37,IF(J$1<'Dados de Entrada'!$B$19+'Dados de Entrada'!$B$18,0,\"\"))","v":0},{"$f":"IF(AND(K$1>='Dados de Entrada'!$B$19+'Dados de Entrada'!$B$18,K$1<='Dados de Entrada'!$B$21),'Dados de Entrada'!$B$55*'Dados de Entrada'!$B$64*'Dados de Entrada'!$B$37,IF(K$1<'Dados de Entrada'!$B$19+'Dados de Entrada'!$B$18,0,\"\"))","v":0},{"$f":"IF(AND(L$1>='Dados de Entrada'!$B$19+'Dados de Entrada'!$B$18,L$1<='Dados de Entrada'!$B$21),'Dados de Entrada'!$B$55*'Dados de Entrada'!$B$64*'Dados de Entrada'!$B$37,IF(L$1<'Dados de Entrada'!$B$19+'Dados de Entrada'!$B$18,0,\"\"))","v":0},{"$f":"IF(AND(M$1>='Dados de Entrada'!$B$19+'Dados de Entrada'!$B$18,M$1<='Dados de Entrada'!$B$21),'Dados de Entrada'!$B$55*'Dados de Entrada'!$B$64*'Dados de Entrada'!$B$37,IF(M$1<'Dados de Entrada'!$B$19+'Dados de Entrada'!$B$18,0,\"\"))","v":0},{"$f":"IF(AND(N$1>='Dados de Entrada'!$B$19+'Dados de Entrada'!$B$18,N$1<='Dados de Entrada'!$B$21),'Dados de Entrada'!$B$55*'Dados de Entrada'!$B$64*'Dados de Entrada'!$B$37,IF(N$1<'Dados de Entrada'!$B$19+'Dados de Entrada'!$B$18,0,\"\"))","v":0},{"$f":"IF(AND(O$1>='Dados de Entrada'!$B$19+'Dados de Entrada'!$B$18,O$1<='Dados de Entrada'!$B$21),'Dados de Entrada'!$B$55*'Dados de Entrada'!$B$64*'Dados de Entrada'!$B$37,IF(O$1<'Dados de Entrada'!$B$19+'Dados de Entrada'!$B$18,0,\"\"))","v":0},{"$f":"IF(AND(P$1>='Dados de Entrada'!$B$19+'Dados de Entrada'!$B$18,P$1<='Dados de Entrada'!$B$21),'Dados de Entrada'!$B$55*'Dados de Entrada'!$B$64*'Dados de Entrada'!$B$37,IF(P$1<'Dados de Entrada'!$B$19+'Dados de Entrada'!$B$18,0,\"\"))","v":0},{"$f":"IF(AND(Q$1>='Dados de Entrada'!$B$19+'Dados de Entrada'!$B$18,Q$1<='Dados de Entrada'!$B$21),'Dados de Entrada'!$B$55*'Dados de Entrada'!$B$64*'Dados de Entrada'!$B$37,IF(Q$1<'Dados de Entrada'!$B$19+'Dados de Entrada'!$B$18,0,\"\"))","v":0},{"$f":"IF(AND(R$1>='Dados de Entrada'!$B$19+'Dados de Entrada'!$B$18,R$1<='Dados de Entrada'!$B$21),'Dados de Entrada'!$B$55*'Dados de Entrada'!$B$64*'Dados de Entrada'!$B$37,IF(R$1<'Dados de Entrada'!$B$19+'Dados de Entrada'!$B$18,0,\"\"))","v":0},{"$f":"IF(AND(S$1>='Dados de Entrada'!$B$19+'Dados de Entrada'!$B$18,S$1<='Dados de Entrada'!$B$21),'Dados de Entrada'!$B$55*'Dados de Entrada'!$B$64*'Dados de Entrada'!$B$37,IF(S$1<'Dados de Entrada'!$B$19+'Dados de Entrada'!$B$18,0,\"\"))","v":0},{"$f":"IF(AND(T$1>='Dados de Entrada'!$B$19+'Dados de Entrada'!$B$18,T$1<='Dados de Entrada'!$B$21),'Dados de Entrada'!$B$55*'Dados de Entrada'!$B$64*'Dados de Entrada'!$B$37,IF(T$1<'Dados de Entrada'!$B$19+'Dados de Entrada'!$B$18,0,\"\"))","v":0},{"$f":"IF(AND(U$1>='Dados de Entrada'!$B$19+'Dados de Entrada'!$B$18,U$1<='Dados de Entrada'!$B$21),'Dados de Entrada'!$B$55*'Dados de Entrada'!$B$64*'Dados de Entrada'!$B$37,IF(U$1<'Dados de Entrada'!$B$19+'Dados de Entrada'!$B$18,0,\"\"))","v":0},{"$f":"IF(AND(V$1>='Dados de Entrada'!$B$19+'Dados de Entrada'!$B$18,V$1<='Dados de Entrada'!$B$21),'Dados de Entrada'!$B$55*'Dados de Entrada'!$B$64*'Dados de Entrada'!$B$37,IF(V$1<'Dados de Entrada'!$B$19+'Dados de Entrada'!$B$18,0,\"\"))","v":0},{"$f":"IF(AND(W$1>='Dados de Entrada'!$B$19+'Dados de Entrada'!$B$18,W$1<='Dados de Entrada'!$B$21),'Dados de Entrada'!$B$55*'Dados de Entrada'!$B$64*'Dados de Entrada'!$B$37,IF(W$1<'Dados de Entrada'!$B$19+'Dados de Entrada'!$B$18,0,\"\"))","v":0},{"$f":"IF(AND(X$1>='Dados de Entrada'!$B$19+'Dados de Entrada'!$B$18,X$1<='Dados de Entrada'!$B$21),'Dados de Entrada'!$B$55*'Dados de Entrada'!$B$64*'Dados de Entrada'!$B$37,IF(X$1<'Dados de Entrada'!$B$19+'Dados de Entrada'!$B$18,0,\"\"))","v":""},{"$f":"IF(AND(Y$1>='Dados de Entrada'!$B$19+'Dados de Entrada'!$B$18,Y$1<='Dados de Entrada'!$B$21),'Dados de Entrada'!$B$55*'Dados de Entrada'!$B$64*'Dados de Entrada'!$B$37,IF(Y$1<'Dados de Entrada'!$B$19+'Dados de Entrada'!$B$18,0,\"\"))","v":""},{"$f":"IF(AND(Z$1>='Dados de Entrada'!$B$19+'Dados de Entrada'!$B$18,Z$1<='Dados de Entrada'!$B$21),'Dados de Entrada'!$B$55*'Dados de Entrada'!$B$64*'Dados de Entrada'!$B$37,IF(Z$1<'Dados de Entrada'!$B$19+'Dados de Entrada'!$B$18,0,\"\"))","v":""},{"$f":"IF(AND(AA$1>='Dados de Entrada'!$B$19+'Dados de Entrada'!$B$18,AA$1<='Dados de Entrada'!$B$21),'Dados de Entrada'!$B$55*'Dados de Entrada'!$B$64*'Dados de Entrada'!$B$37,IF(AA$1<'Dados de Entrada'!$B$19+'Dados de Entrada'!$B$18,0,\"\"))","v":""},{"$f":"IF(AND(AB$1>='Dados de Entrada'!$B$19+'Dados de Entrada'!$B$18,AB$1<='Dados de Entrada'!$B$21),'Dados de Entrada'!$B$55*'Dados de Entrada'!$B$64*'Dados de Entrada'!$B$37,IF(AB$1<'Dados de Entrada'!$B$19+'Dados de Entrada'!$B$18,0,\"\"))","v":""},{"$f":"IF(AND(AC$1>='Dados de Entrada'!$B$19+'Dados de Entrada'!$B$18,AC$1<='Dados de Entrada'!$B$21),'Dados de Entrada'!$B$55*'Dados de Entrada'!$B$64*'Dados de Entrada'!$B$37,IF(AC$1<'Dados de Entrada'!$B$19+'Dados de Entrada'!$B$18,0,\"\"))","v":""},{"$f":"IF(AND(AD$1>='Dados de Entrada'!$B$19+'Dados de Entrada'!$B$18,AD$1<='Dados de Entrada'!$B$21),'Dados de Entrada'!$B$55*'Dados de Entrada'!$B$64*'Dados de Entrada'!$B$37,IF(AD$1<'Dados de Entrada'!$B$19+'Dados de Entrada'!$B$18,0,\"\"))","v":""},{"$f":"IF(AND(AE$1>='Dados de Entrada'!$B$19+'Dados de Entrada'!$B$18,AE$1<='Dados de Entrada'!$B$21),'Dados de Entrada'!$B$55*'Dados de Entrada'!$B$64*'Dados de Entrada'!$B$37,IF(AE$1<'Dados de Entrada'!$B$19+'Dados de Entrada'!$B$18,0,\"\"))","v":""},{"$f":"IF(AND(AF$1>='Dados de Entrada'!$B$19+'Dados de Entrada'!$B$18,AF$1<='Dados de Entrada'!$B$21),'Dados de Entrada'!$B$55*'Dados de Entrada'!$B$64*'Dados de Entrada'!$B$37,IF(AF$1<'Dados de Entrada'!$B$19+'Dados de Entrada'!$B$18,0,\"\"))","v":""},{"$f":"IF(AND(AG$1>='Dados de Entrada'!$B$19+'Dados de Entrada'!$B$18,AG$1<='Dados de Entrada'!$B$21),'Dados de Entrada'!$B$55*'Dados de Entrada'!$B$64*'Dados de Entrada'!$B$37,IF(AG$1<'Dados de Entrada'!$B$19+'Dados de Entrada'!$B$18,0,\"\"))","v":""},{"$f":"IF(AND(AH$1>='Dados de Entrada'!$B$19+'Dados de Entrada'!$B$18,AH$1<='Dados de Entrada'!$B$21),'Dados de Entrada'!$B$55*'Dados de Entrada'!$B$64*'Dados de Entrada'!$B$37,IF(AH$1<'Dados de Entrada'!$B$19+'Dados de Entrada'!$B$18,0,\"\"))","v":""},{"$f":"IF(AND(AI$1>='Dados de Entrada'!$B$19+'Dados de Entrada'!$B$18,AI$1<='Dados de Entrada'!$B$21),'Dados de Entrada'!$B$55*'Dados de Entrada'!$B$64*'Dados de Entrada'!$B$37,IF(AI$1<'Dados de Entrada'!$B$19+'Dados de Entrada'!$B$18,0,\"\"))","v":""},{"$f":"IF(AND(AJ$1>='Dados de Entrada'!$B$19+'Dados de Entrada'!$B$18,AJ$1<='Dados de Entrada'!$B$21),'Dados de Entrada'!$B$55*'Dados de Entrada'!$B$64*'Dados de Entrada'!$B$37,IF(AJ$1<'Dados de Entrada'!$B$19+'Dados de Entrada'!$B$18,0,\"\"))","v":""},{"$f":"IF(AND(AK$1>='Dados de Entrada'!$B$19+'Dados de Entrada'!$B$18,AK$1<='Dados de Entrada'!$B$21),'Dados de Entrada'!$B$55*'Dados de Entrada'!$B$64*'Dados de Entrada'!$B$37,IF(AK$1<'Dados de Entrada'!$B$19+'Dados de Entrada'!$B$18,0,\"\"))","v":""},{"$f":"IF(AND(AL$1>='Dados de Entrada'!$B$19+'Dados de Entrada'!$B$18,AL$1<='Dados de Entrada'!$B$21),'Dados de Entrada'!$B$55*'Dados de Entrada'!$B$64*'Dados de Entrada'!$B$37,IF(AL$1<'Dados de Entrada'!$B$19+'Dados de Entrada'!$B$18,0,\"\"))","v":""},{"$f":"IF(AND(AM$1>='Dados de Entrada'!$B$19+'Dados de Entrada'!$B$18,AM$1<='Dados de Entrada'!$B$21),'Dados de Entrada'!$B$55*'Dados de Entrada'!$B$64*'Dados de Entrada'!$B$37,IF(AM$1<'Dados de Entrada'!$B$19+'Dados de Entrada'!$B$18,0,\"\"))","v":""},{"$f":"IF(AND(AN$1>='Dados de Entrada'!$B$19+'Dados de Entrada'!$B$18,AN$1<='Dados de Entrada'!$B$21),'Dados de Entrada'!$B$55*'Dados de Entrada'!$B$64*'Dados de Entrada'!$B$37,IF(AN$1<'Dados de Entrada'!$B$19+'Dados de Entrada'!$B$18,0,\"\"))","v":""},{"$f":"IF(AND(AO$1>='Dados de Entrada'!$B$19+'Dados de Entrada'!$B$18,AO$1<='Dados de Entrada'!$B$21),'Dados de Entrada'!$B$55*'Dados de Entrada'!$B$64*'Dados de Entrada'!$B$37,IF(AO$1<'Dados de Entrada'!$B$19+'Dados de Entrada'!$B$18,0,\"\"))","v":""}]
["Opex associado à Energia Elétrica (2.2.1.2)",{"$f":"IF(AND(B$1>='Dados de Entrada'!$B$19+'Dados de Entrada'!$B$18,B$1<='Dados de Entrada'!$B$21),'Dados de Entrada'!$B$55*'Dados de Entrada'!$B$65*'Dados de Entrada'!$B$38,IF(B$1<'Dados de Entrada'!$B$19+'Dados de Entrada'!$B$18,0,\"\"))","v":0},{"$f":"IF(AND(C$1>='Dados de Entrada'!$B$19+'Dados de Entrada'!$B$18,C$1<='Dados de Entrada'!$B$21),'Dados de Entrada'!$B$55*'Dados de Entrada'!$B$65*'Dados de Entrada'!$B$38,IF(C$1<'Dados de Entrada'!$B$19+'Dados de Entrada'!$B$18,0,\"\"))","v":0},{"$f":"IF(AND(D$1>='Dados de Entrada'!$B$19+'Dados de Entrada'!$B$18,D$1<='Dados de Entrada'!$B$21),'Dados de Entrada'!$B$55*'Dados de Entrada'!$B$65*'Dados de Entrada'!$B$38,IF(D$1<'Dados de Entrada'!$B$19+'Dados de Entrada'!$B$18,0,\"\"))","v":0},{"$f":"IF(AND(E$1>='Dados de Entrada'!$B$19+'Dados de Entrada'!$B$18,E$1<='Dados de Entrada'!$B$21),'Dados de Entrada'!$B$55*'Dados de Entrada'!$B$65*'Dados de Entrada'!$B$38,IF(E$1<'Dados de Entrada'!$B$19+'Dados de Entrada'!$B$18,0,\"\"))","v":0},{"$f":"IF(AND(F$1>='Dados de Entrada'!$B$19+'Dados de Entrada'!$B$18,F$1<='Dados de Entrada'!$B$21),'Dados de Entrada'!$B$55*'Dados de Entrada'!$B$65*'Dados de Entrada'!$B$38,IF(F$1<'Dados de Entrada'!$B$19+'Dados de Entrada'!$B$18,0,\"\"))","v":0},{"$f":"IF(AND(G$1>='Dados de Entrada'!$B$19+'Dados de Entrada'!$B$18,G$1<='Dados de Entrada'!$B$21),'Dados de Entrada'!$B$55*'Dados de Entrada'!$B$65*'Dados de Entrada'!$B$38,IF(G$1<'Dados de Entrada'!$B$19+'Dados de Entrada'!$B$18,0,\"\"))","v":0},{"$f":"IF(AND(H$1>='Dados de Entrada'!$B$19+'Dados de Entrada'!$B$18,H$1<='Dados de Entrada'!$B$21),'Dados de Entrada'!$B$55*'Dados de Entrada'!$B$65*'Dados de Entrada'!$B$38,IF(H$1<'Dados de Entrada'!$B$19+'Dados de Entrada'!$B$18,0,\"\"))","v":0},{"$f":"IF(AND(I$1>='Dados de Entrada'!$B$19+'Dados de Entrada'!$B$18,I$1<='Dados de Entrada'!$B$21),'Dados de Entrada'!$B$55*'Dados de Entrada'!$B$65*'Dados de Entrada'!$B$38,IF(I$1<'Dados de Entrada'!$B$19+'Dados de Entrada'!$B$18,0,\"\"))","v":0},{"$f":"IF(AND(J$1>='Dados de Entrada'!$B$19+'Dados de Entrada'!$B$18,J$1<='Dados de Entrada'!$B$21),'Dados de Entrada'!$B$55*'Dados de Entrada'!$B$65*'Dados de Entrada'!$B$38,IF(J$1<'Dados de Entrada'!$B$19+'Dados de Entrada'!$B$18,0,\"\"))","v":0},{"$f":"IF(AND(K$1>='Dados de Entrada'!$B$19+'Dados de Entrada'!$B$18,K$1<='Dados de Entrada'!$B$21),'Dados de Entrada'!$B$55*'Dados de Entrada'!$B$65*'Dados de Entrada'!$B$38,IF(K$1<'Dados de Entrada'!$B$19+'Dados de Entrada'!$B$18,0,\"\"))","v":0},{"$f":"IF(AND(L$1>='Dados de Entrada'!$B$19+'Dados de Entrada'!$B$18,L$1<='Dados de Entrada'!$B$21),'Dados de Entrada'!$B$55*'Dados de Entrada'!$B$65*'Dados de Entrada'!$B$38,IF(L$1<'Dados de Entrada'!$B$19+'Dados de Entrada'!$B$18,0,\"\"))","v":0},{"$f":"IF(AND(M$1>='Dados de Entrada'!$B$19+'Dados de Entrada'!$B$18,M$1<='Dados de Entrada'!$B$21),'Dados de Entrada'!$B$55*'Dados de Entrada'!$B$65*'Dados de Entrada'!$B$38,IF(M$1<'Dados de Entrada'!$B$19+'Dados de Entrada'!$B$18,0,\"\"))","v":0},{"$f":"IF(AND(N$1>='Dados de Entrada'!$B$19+'Dados de Entrada'!$B$18,N$1<='Dados de Entrada'!$B$21),'Dados de Entrada'!$B$55*'Dados de Entrada'!$B$65*'Dados de Entrada'!$B$38,IF(N$1<'Dados de Entrada'!$B$19+'Dados de Entrada'!$B$18,0,\"\"))","v":0},{"$f":"IF(AND(O$1>='Dados de Entrada'!$B$19+'Dados de Entrada'!$B$18,O$1<='Dados de Entrada'!$B$21),'Dados de Entrada'!$B$55*'Dados de Entrada'!$B$65*'Dados de Entrada'!$B$38,IF(O$1<'Dados de Entrada'!$B$19+'Dados de Entrada'!$B$18,0,\"\"))","v":0},{"$f":"IF(AND(P$1>='Dados de Entrada'!$B$19+'Dados de Entrada'!$B$18,P$1<='Dados de Entrada'!$B$21),'Dados de Entrada'!$B$55*'Dados de Entrada'!$B$65*'Dados de Entrada'!$B$38,IF(P$1<'Dados de Entrada'!$B$19+'Dados de Entrada'!$B$18,0,\"\"))","v":0},{"$f":"IF(AND(Q$1>='Dados de Entrada'!$B$19+'Dados de Entrada'!$B$18,Q$1<='Dados de Entrada'!$B$21),'Dados de Entrada'!$B$55*'Dados de Entrada'!$B$65*'Dados de Entrada'!$B$38,IF(Q$1<'Dados de Entrada'!$B$19+'Dados de Entrada'!$B$18,0,\"\"))","v":0},{"$f":"IF(AND(R$1>='Dados de Entrada'!$B$19+'Dados de Entrada'!$B$18,R$1<='Dados de Entrada'!$B$21),'Dados de Entrada'!$B$55*'Dados de Entrada'!$B$65*'Dados de Entrada'!$B$38,IF(R$1<'Dados de Entrada'!$B$19+'Dados de Entrada'!$B$18,0,\"\"))","v":0},{"$f":"IF(AND(S$1>='Dados de Entrada'!$B$19+'Dados de Entrada'!$B$18,S$1<='Dados de Entrada'!$B$21),'Dados de Entrada'!$B$55*'Dados de Entrada'!$B$65*'Dados de Entrada'!$B$38,IF(S$1<'Dados de Entrada'!$B$19+'Dados de Entrada'!$B$18,0,\"\"))","v":0},{"$f":"IF(AND(T$1>='Dados de Entrada'!$B$19+'Dados de Entrada'!$B$18,T$1<='Dados de Entrada'!$B$21),'Dados de Entrada'!$B$55*'Dados de Entrada'!$B$65*'Dados de Entrada'!$B$38,IF(T$1<'Dados de Entrada'!$B$19+'Dados de Entrada'!$B$18,0,\"\"))","v":0},{"$f":"IF(AND(U$1>='Dados de Entrada'!$B$19+'Dados de Entrada'!$B$18,U$1<='Dados de Entrada'!$B$21),'Dados de Entrada'!$B$55*'Dados de Entrada'!$B$65*'Dados de Entrada'!$B$38,IF(U$1<'Dados de Entrada'!$B$19+'Dados de Entrada'!$B$18,0,\"\"))","v":0},{"$f":"IF(AND(V$1>='Dados de Entrada'!$B$19+'Dados de Entrada'!$B$18,V$1<='Dados de Entrada'!$B$21),'Dados de Entrada'!$B$55*'Dados de Entrada'!$B$65*'Dados de Entrada'!$B$38,IF(V$1<'Dados de Entrada'!$B$19+'Dados de Entrada'!$B$18,0,\"\"))","v":0},{"$f":"IF(AND(W$1>='Dados de Entrada'!$B$19+'Dados de Entrada'!$B$18,W$1<='Dados de Entrada'!$B$21),'Dados de Entrada'!$B$55*'Dados de Entrada'!$B$65*'Dados de Entrada'!$B$38,IF(W$1<'Dados de Entrada'!$B$19+'Dados de Entrada'!$B$18,0,\"\"))","v":0},{"$f":"IF(AND(X$1>='Dados de Entrada'!$B$19+'Dados de Entrada'!$B$18,X$1<='Dados de Entrada'!$B$21),'Dados de Entrada'!$B$55*'Dados de Entrada'!$B$65*'Dados de Entrada'!$B$38,IF(X$1<'Dados de Entrada'!$B$19+'Dados de Entrada'!$B$18,0,\"\"))","v":""},{"$f":"IF(AND(Y$1>='Dados de Entrada'!$B$19+'Dados de Entrada'!$B$18,Y$1<='Dados de Entrada'!$B$21),'Dados de Entrada'!$B$55*'Dados de Entrada'!$B$65*'Dados de Entrada'!$B$38,IF(Y$1<'Dados de Entrada'!$B$19+'Dados de Entrada'!$B$18,0,\"\"))","v":""},{"$f":"IF(AND(Z$1>='Dados de Entrada'!$B$19+'Dados de Entrada'!$B$18,Z$1<='Dados de Entrada'!$B$21),'Dados de Entrada'!$B$55*'Dados de Entrada'!$B$65*'Dados de Entrada'!$B$38,IF(Z$1<'Dados de Entrada'!$B$19+'Dados de Entrada'!$B$18,0,\"\"))","v":""},{"$f":"IF(AND(AA$1>='Dados de Entrada'!$B$19+'Dados de Entrada'!$B$18,AA$1<='Dados de Entrada'!$B$21),'Dados de Entrada'!$B$55*'Dados de Entrada'!$B$65*'Dados de Entrada'!$B$38,IF(AA$1<'Dados de Entrada'!$B$19+'Dados de Entrada'!$B$18,0,\"\"))","v":""},{"$f":"IF(AND(AB$1>='Dados de Entrada'!$B$19+'Dados de Entrada'!$B$18,AB$1<='Dados de Entrada'!$B$21),'Dados de Entrada'!$B$55*'Dados de Entrada'!$B$65*'Dados de Entrada'!$B$38,IF(AB$1<'Dados de Entrada'!$B$19+'Dados de Entrada'!$B$18,0,\"\"))","v":""},{"$f":"IF(AND(AC$1>='Dados de Entrada'!$B$19+'Dados de Entrada'!$B$18,AC$1<='Dados de Entrada'!$B$21),'Dados de Entrada'!$B$55*'Dados de Entrada'!$B$65*'Dados de Entrada'!$B$38,IF(AC$1<'Dados de Entrada'!$B$19+'Dados de Entrada'!$B$18,0,\"\"))","v":""},{"$f":"IF(AND(AD$1>='Dados de Entrada'!$B$19+'Dados de Entrada'!$B$18,AD$1<='Dados de Entrada'!$B$21),'Dados de Entrada'!$B$55*'Dados de Entrada'!$B$65*'Dados de Entrada'!$B$38,IF(AD$1<'Dados de Entrada'!$B$19+'Dados de Entrada'!$B$18,0,\"\"))","v":""},{"$f":"IF(AND(AE$1>='Dados de Entrada'!$B$19+'Dados de Entrada'!$B$18,AE$1<='Dados de Entrada'!$B$21),'Dados de Entrada'!$B$55*'Dados de Entrada'!$B$65*'Dados de Entrada'!$B$38,IF(AE$1<'Dados de Entrada'!$B$19+'Dados de Entrada'!$B$18,0,\"\"))","v":""},{"$f":"IF(AND(AF$1>='Dados de Entrada'!$B$19+'Dados de Entrada'!$B$18,AF$1<='Dados de Entrada'!$B$21),'Dados de Entrada'!$B$55*'Dados de Entrada'!$B$65*'Dados de Entrada'!$B$38,IF(AF$1<'Dados de Entrada'!$B$19+'Dados de Entrada'!$B$18,0,\"\"))","v":""},{"$f":"IF(AND(AG$1>='Dados de Entrada'!$B$19+'Dados de Entrada'!$B$18,AG$1<='Dados de Entrada'!$B$21),'Dados de Entrada'!$B$55*'Dados de Entrada'!$B$65*'Dados de Entrada'!$B$38,IF(AG$1<'Dados de Entrada'!$B$19+'Dados de Entrada'!$B$18,0,\"\"))","v":""},{"$f":"IF(AND(AH$1>='Dados de Entrada'!$B$19+'Dados de Entrada'!$B$18,AH$1<='Dados de Entrada'!$B$21),'Dados de Entrada'!$B$55*'Dados de Entrada'!$B$65*'Dados de Entrada'!$B$38,IF(AH$1<'Dados de Entrada'!$B$19+'Dados de Entrada'!$B$18,0,\"\"))","v":""},{"$f":"IF(AND(AI$1>='Dados de Entrada'!$B$19+'Dados de Entrada'!$B$18,AI$1<='Dados de Entrada'!$B$21),'Dados de Entrada'!$B$55*'Dados de Entrada'!$B$65*'Dados de Entrada'!$B$38,IF(AI$1<'Dados de Entrada'!$B$19+'Dados de Entrada'!$B$18,0,\"\"))","v":""},{"$f":"IF(AND(AJ$1>='Dados de Entrada'!$B$19+'Dados de Entrada'!$B$18,AJ$1<='Dados de Entrada'!$B$21),'Dados de Entrada'!$B$55*'Dados de Entrada'!$B$65*'Dados de Entrada'!$B$38,IF(AJ$1<'Dados de Entrada'!$B$19+'Dados de Entrada'!$B$18,0,\"\"))","v":""},{"$f":"IF(AND(AK$1>='Dados de Entrada'!$B$19+'Dados de Entrada'!$B$18,AK$1<='Dados de Entrada'!$B$21),'Dados de Entrada'!$B$55*'Dados de Entrada'!$B$65*'Dados de Entrada'!$B$38,IF(AK$1<'Dados de Entrada'!$B$19+'Dados de Entrada'!$B$18,0,\"\"))","v":""},{"$f":"IF(AND(AL$1>='Dados de Entrada'!$B$19+'Dados de Entrada'!$B$18,AL$1<='Dados de Entrada'!$B$21),'Dados de Entrada'!$B$55*'Dados de Entrada'!$B$65*'Dados de Entrada'!$B$38,IF(AL$1<'Dados de Entrada'!$B$19+'Dados de Entrada'!$B$18,0,\"\"))","v":""},{"$f":"IF(AND(AM$1>='Dados de Entrada'!$B$19+'Dados de Entrada'!$B$18,AM$1<='Dados de Entrada'!$B$21),'Dados de Entrada'!$B$55*'Dados de Entrada'!$B$65*'Dados de Entrada'!$B$38,IF(AM$1<'Dados de Entrada'!$B$19+'Dados de Entrada'!$B$18,0,\"\"))","v":""},{"$f":"IF(AND(AN$1>='Dados de Entrada'!$B$19+'Dados de Entrada'!$B$18,AN$1<='Dados de Entrada'!$B$21),'Dados de Entrada'!$B$55*'Dados de Entrada'!$B$65*'Dados de Entrada'!$B$38,IF(AN$1<'Dados de Entrada'!$B$19+'Dados de Entrada'!$B$18,0,\"\"))","v":""},{"$f":"IF(AND(AO$1>='Dados de Entrada'!$B$19+'Dados de Entrada'!$B$18,AO$1<='Dados de Entrada'!$B$21),'Dados de Entrada'!$B$55*'Dados de Entrada'!$B$65*'Dados de Entrada'!$B$38,IF(AO$1<'Dados de Entrada'!$B$19+'Dados de Entrada'!$B$18,0,\"\"))","v":""}]
["Opex associado a Outros custos operacionais (2.2.1.3)",{"$f":"IF(AND(B$1>='Dados de Entrada'!$B$19+'Dados de Entrada'!$B$18,B$1<='Dados de Entrada'!$B$21),'Dados de Entrada'!$B$66*'Dados de Entrada'!$B$62,IF(B$1<'Dados de Entrada'!$B$19+'Dados de Entrada'!$B$18,0,\"\"))","v":0},{"$f":"IF(AND(C$1>='Dados de Entrada'!$B$19+'Dados de Entrada'!$B$18,C$1<='Dados de Entrada'!$B$21),'Dados de Entrada'!$B$66*'Dados de Entrada'!$B$62,IF(C$1<'Dados de Entrada'!$B$19+'Dados de Entrada'!$B$18,0,\"\"))","v":0},{"$f":"IF(AND(D$1>='Dados de Entrada'!$B$19+'Dados de Entrada'!$B$18,D$1<='Dados de Entrada'!$B$21),'Dados de Entrada'!$B$66*'Dados de Entrada'!$B$62,IF(D$1<'Dados de Entrada'!$B$19+'Dados de Entrada'!$B$18,0,\"\"))","v":0},{"$f":"IF(AND(E$1>='Dados de Entrada'!$B$19+'Dados de Entrada'!$B$18,E$1<='Dados de Entrada'!$B$21),'Dados de Entrada'!$B$66*'Dados de Entrada'!$B$62,IF(E$1<'Dados de Entrada'!$B$19+'Dados de Entrada'!$B$18,0,\"\"))","v":0},{"$f":"IF(AND(F$1>='Dados de Entrada'!$B$19+'Dados de Entrada'!$B$18,F$1<='Dados de Entrada'!$B$21),'Dados de Entrada'!$B$66*'Dados de Entrada'!$B$62,IF(F$1<'Dados de Entrada'!$B$19+'Dados de Entrada'!$B$18,0,\"\"))","v":0},{"$f":"IF(AND(G$1>='Dados de Entrada'!$B$19+'Dados de Entrada'!$B$18,G$1<='Dados de Entrada'!$B$21),'Dados de Entrada'!$B$66*'Dados de Entrada'!$B$62,IF(G$1<'Dados de Entrada'!$B$19+'Dados de Entrada'!$B$18,0,\"\"))","v":0},{"$f":"IF(AND(H$1>='Dados de Entrada'!$B$19+'Dados de Entrada'!$B$18,H$1<='Dados de Entrada'!$B$21),'Dados de Entrada'!$B$66*'Dados de Entrada'!$B$62,IF(H$1<'Dados de Entrada'!$B$19+'Dados de Entrada'!$B$18,0,\"\"))","v":0},{"$f":"IF(AND(I$1>='Dados de Entrada'!$B$19+'Dados de Entrada'!$B$18,I$1<='Dados de Entrada'!$B$21),'Dados de Entrada'!$B$66*'Dados de Entrada'!$B$62,IF(I$1<'Dados de Entrada'!$B$19+'Dados de Entrada'!$B$18,0,\"\"))","v":0},{"$f":"IF(AND(J$1>='Dados de Entrada'!$B$19+'Dados de Entrada'!$B$18,J$1<='Dados de Entrada'!$B$21),'Dados de Entrada'!$B$66*'Dados de Entrada'!$B$62,IF(J$1<'Dados de Entrada'!$B$19+'Dados de Entrada'!$B$18,0,\"\"))","v":0},{"$f":"IF(AND(K$1>='Dados de Entrada'!$B$19+'Dados de Entrada'!$B$18,K$1<='Dados de Entrada'!$B$21),'Dados de Entrada'!$B$66*'Dados de Entrada'!$B$62,IF(K$1<'Dados de Entrada'!$B$19+'Dados de Entrada'!$B$18,0,\"\"))","v":0},{"$f":"IF(AND(L$1>='Dados de Entrada'!$B$19+'Dados de Entrada'!$B$18,L$1<='Dados de Entrada'!$B$21),'Dados de Entrada'!$B$66*'Dados de Entrada'!$B$62,IF(L$1<'Dados de Entrada'!$B$19+'Dados de Entrada'!$B$18,0,\"\"))","v":0},{"$f":"IF(AND(M$1>='Dados de Entrada'!$B$19+'Dados de Entrada'!$B$18,M$1<='Dados de Entrada'!$B$21),'Dados de Entrada'!$B$66*'Dados de Entrada'!$B$62,IF(M$1<'Dados de Entrada'!$B$19+'Dados de Entrada'!$B$18,0,\"\"))","v":0},{"$f":"IF(AND(N$1>='Dados de Entrada'!$B$19+'Dados de Entrada'!$B$18,N$1<='Dados de Entrada'!$B$21),'Dados de Entrada'!$B$66*'Dados de Entrada'!$B$62,IF(N$1<'Dados de Entrada'!$B$19+'Dados de Entrada'!$B$18,0,\"\"))","v":0},{"$f":"IF(AND(O$1>='Dados de Entrada'!$B$19+'Dados de Entrada'!$B$18,O$1<='Dados de Entrada'!$B$21),'Dados de Entrada'!$B$66*'Dados de Entrada'!$B$62,IF(O$1<'Dados de Entrada'!$B$19+'Dados de Entrada'!$B$18,0,\"\"))","v":0},{"$f":"IF(AND(P$1>='Dados de Entrada'!$B$19+'Dados de Entrada'!$B$18,P$1<='Dados de Entrada'!$B$21),'Dados de Entrada'!$B$66*'Dados de Entrada'!$B$62,IF(P$1<'Dados de Entrada'!$B$19+'Dados de Entrada'!$B$18,0,\"\"))","v":0},{"$f":"IF(AND(Q$1>='Dados de Entrada'!$B$19+'Dados de Entrada'!$B$18,Q$1<='Dados de Entrada'!$B$21),'Dados de Entrada'!$B$66*'Dados de Entrada'!$B$62,IF(Q$1<'Dados de Entrada'!$B$19+'Dados de Entrada'!$B$18,0,\"\"))","v":0},{"$f":"IF(AND(R$1>='Dados de Entrada'!$B$19+'Dados de Entrada'!$B$18,R$1<='Dados de Entrada'!$B$21),'Dados de Entrada'!$B$66*'Dados de Entrada'!$B$62,IF(R$1<'Dados de Entrada'!$B$19+'Dados de Entrada'!$B$18,0,\"\"))","v":0},{"$f":"IF(AND(S$1>='Dados de Entrada'!$B$19+'Dados de Entrada'!$B$18,S$1<='Dados de Entrada'!$B$21),'Dados de Entrada'!$B$66*'Dados de Entrada'!$B$62,IF(S$1<'Dados de Entrada'!$B$19+'Dados de Entrada'!$B$18,0,\"\"))","v":0},{"$f":"IF(AND(T$1>='Dados de Entrada'!$B$19+'Dados de Entrada'!$B$18,T$1<='Dados de Entrada'!$B$21),'Dados de Entrada'!$B$66*'Dados de Entrada'!$B$62,IF(T$1<'Dados de Entrada'!$B$19+'Dados de Entrada'!$B$18,0,\"\"))","v":0},{"$f":"IF(AND(U$1>='Dados de Entrada'!$B$19+'Dados de Entrada'!$B$18,U$1<='Dados de Entrada'!$B$21),'Dados de Entrada'!$B$66*'Dados de Entrada'!$B$62,IF(U$1<'Dados de Entrada'!$B$19+'Dados de Entrada'!$B$18,0,\"\"))","v":0},{"$f":"IF(AND(V$1>='Dados de Entrada'!$B$19+'Dados de Entrada'!$B$18,V$1<='Dados de Entrada'!$B$21),'Dados de Entrada'!$B$66*'Dados de Entrada'!$B$62,IF(V$1<'Dados de Entrada'!$B$19+'Dados de Entrada'!$B$18,0,\"\"))","v":0},{"$f":"IF(AND(W$1>='Dados de Entrada'!$B$19+'Dados de Entrada'!$B$18,W$1<='Dados de Entrada'!$B$21),'Dados de Entrada'!$B$66*'Dados de Entrada'!$B$62,IF(W$1<'Dados de Entrada'!$B$19+'Dados de Entrada'!$B$18,0,\"\"))","v":0},{"$f":"IF(AND(X$1>='Dados de Entrada'!$B$19+'Dados de Entrada'!$B$18,X$1<='Dados de Entrada'!$B$21),'Dados de Entrada'!$B$66*'Dados de Entrada'!$B$62,IF(X$1<'Dados de Entrada'!$B$19+'Dados de Entrada'!$B$18,0,\"\"))","v":""},{"$f":"IF(AND(Y$1>='Dados de Entrada'!$B$19+'Dados de Entrada'!$B$18,Y$1<='Dados de Entrada'!$B$21),'Dados de Entrada'!$B$66*'Dados de Entrada'!$B$62,IF(Y$1<'Dados de Entrada'!$B$19+'Dados de Entrada'!$B$18,0,\"\"))","v":""},{"$f":"IF(AND(Z$1>='Dados de Entrada'!$B$19+'Dados de Entrada'!$B$18,Z$1<='Dados de Entrada'!$B$21),'Dados de Entrada'!$B$66*'Dados de Entrada'!$B$62,IF(Z$1<'Dados de Entrada'!$B$19+'Dados de Entrada'!$B$18,0,\"\"))","v":""},{"$f":"IF(AND(AA$1>='Dados de Entrada'!$B$19+'Dados de Entrada'!$B$18,AA$1<='Dados de Entrada'!$B$21),'Dados de Entrada'!$B$66*'Dados de Entrada'!$B$62,IF(AA$1<'Dados de Entrada'!$B$19+'Dados de Entrada'!$B$18,0,\"\"))","v":""},{"$f":"IF(AND(AB$1>='Dados de Entrada'!$B$19+'Dados de Entrada'!$B$18,AB$1<='Dados de Entrada'!$B$21),'Dados de Entrada'!$B$66*'Dados de Entrada'!$B$62,IF(AB$1<'Dados de Entrada'!$B$19+'Dados de Entrada'!$B$18,0,\"\"))","v":""},{"$f":"IF(AND(AC$1>='Dados de Entrada'!$B$19+'Dados de Entrada'!$B$18,AC$1<='Dados de Entrada'!$B$21),'Dados de Entrada'!$B$66*'Dados de Entrada'!$B$62,IF(AC$1<'Dados de Entrada'!$B$19+'Dados de Entrada'!$B$18,0,\"\"))","v":""},{"$f":"IF(AND(AD$1>='Dados de Entrada'!$B$19+'Dados de Entrada'!$B$18,AD$1<='Dados de Entrada'!$B$21),'Dados de Entrada'!$B$66*'Dados de Entrada'!$B$62,IF(AD$1<'Dados de Entrada'!$B$19+'Dados de Entrada'!$B$18,0,\"\"))","v":""},{"$f":"IF(AND(AE$1>='Dados de Entrada'!$B$19+'Dados de Entrada'!$B$18,AE$1<='Dados de Entrada'!$B$21),'Dados de Entrada'!$B$66*'Dados de Entrada'!$B$62,IF(AE$1<'Dados de Entrada'!$B$19+'Dados de Entrada'!$B$18,0,\"\"))","v":""},{"$f":"IF(AND(AF$1>='Dados de Entrada'!$B$19+'Dados de Entrada'!$B$18,AF$1<='Dados de Entrada'!$B$21),'Dados de Entrada'!$B$66*'Dados de Entrada'!$B$62,IF(AF$1<'Dados de Entrada'!$B$19+'Dados de Entrada'!$B$18,0,\"\"))","v":""},{"$f":"IF(AND(AG$1>='Dados de Entrada'!$B$19+'Dados de Entrada'!$B$18,AG$1<='Dados de Entrada'!$B$21),'Dados de Entrada'!$B$66*'Dados de Entrada'!$B$62,IF(AG$1<'Dados de Entrada'!$B$19+'Dados de Entrada'!$B$18,0,\"\"))","v":""},{"$f":"IF(AND(AH$1>='Dados de Entrada'!$B$19+'Dados de Entrada'!$B$18,AH$1<='Dados de Entrada'!$B$21),'Dados de Entrada'!$B$66*'Dados de Entrada'!$B$62,IF(AH$1<'Dados de Entrada'!$B$19+'Dados de Entrada'!$B$18,0,\"\"))","v":""},{"$f":"IF(AND(AI$1>='Dados de Entrada'!$B$19+'Dados de Entrada'!$B$18,AI$1<='Dados de Entrada'!$B$21),'Dados de Entrada'!$B$66*'Dados de Entrada'!$B$62,IF(AI$1<'Dados de Entrada'!$B$19+'Dados de Entrada'!$B$18,0,\"\"))","v":""},{"$f":"IF(AND(AJ$1>='Dados de Entrada'!$B$19+'Dados de Entrada'!$B$18,AJ$1<='Dados de Entrada'!$B$21),'Dados de Entrada'!$B$66*'Dados de Entrada'!$B$62,IF(AJ$1<'Dados de Entrada'!$B$19+'Dados de Entrada'!$B$18,0,\"\"))","v":""},{"$f":"IF(AND(AK$1>='Dados de Entrada'!$B$19+'Dados de Entrada'!$B$18,AK$1<='Dados de Entrada'!$B$21),'Dados de Entrada'!$B$66*'Dados de Entrada'!$B$62,IF(AK$1<'Dados de Entrada'!$B$19+'Dados de Entrada'!$B$18,0,\"\"))","v":""},{"$f":"IF(AND(AL$1>='Dados de Entrada'!$B$19+'Dados de Entrada'!$B$18,AL$1<='Dados de Entrada'!$B$21),'Dados de Entrada'!$B$66*'Dados de Entrada'!$B$62,IF(AL$1<'Dados de Entrada'!$B$19+'Dados de Entrada'!$B$18,0,\"\"))","v":""},{"$f":"IF(AND(AM$1>='Dados de Entrada'!$B$19+'Dados de Entrada'!$B$18,AM$1<='Dados de Entrada'!$B$21),'Dados de Entrada'!$B$66*'Dados de Entrada'!$B$62,IF(AM$1<'Dados de Entrada'!$B$19+'Dados de Entrada'!$B$18,0,\"\"))","v":""},{"$f":"IF(AND(AN$1>='Dados de Entrada'!$B$19+'Dados de Entrada'!$B$18,AN$1<='Dados de Entrada'!$B$21),'Dados de Entrada'!$B$66*'Dados de Entrada'!$B$62,IF(AN$1<'Dados de Entrada'!$B$19+'Dados de Entrada'!$B$18,0,\"\"))","v":""},{"$f":"IF(AND(AO$1>='Dados de Entrada'!$B$19+'Dados de Entrada'!$B$18,AO$1<='Dados de Entrada'!$B$21),'Dados de Entrada'!$B$66*'Dados de Entrada'!$B$62,IF(AO$1<'Dados de Entrada'!$B$19+'Dados de Entrada'!$B$18,0,\"\"))","v":""}]
["Opex do Transporte de CO2 (2.2.2) = (2.2.2.1) + (2.2.2.2)",{"$f":"IF(AND(B$1>='Dados de Entrada'!$B$19+'Dados de Entrada'!$B$18,B$1<='Dados de Entrada'!$B$21),SUM(B16:B17),IF(B$1<'Dados de Entrada'!$B$19+'Dados de Entrada'!$B$18,0,\"\"))","v":0},{"$f":"IF(AND(C$1>='Dados de Entrada'!$B$19+'Dados de Entrada'!$B$18,C$1<='Dados de Entrada'!$B$21),SUM(C16:C17),IF(C$1<'Dados de Entrada'!$B$19+'Dados de Entrada'!$B$18,0,\"\"))","v":0},{"$f":"IF(AND(D$1>='Dados de Entrada'!$B$19+'Dados de Entrada'!$B$18,D$1<='Dados de Entrada'!$B$21),SUM(D16:D17),IF(D$1<'Dados de Entrada'!$B$19+'Dados de Entrada'!$B$18,0,\"\"))","v":0},{"$f":"IF(AND(E$1>='Dados de Entrada'!$B$19+'Dados de Entrada'!$B$18,E$1<='Dados de Entrada'!$B$21),SUM(E16:E17),IF(E$1<'Dados de Entrada'!$B$19+'Dados de Entrada'!$B$18,0,\"\"))","v":0},{"$f":"IF(AND(F$1>='Dados de Entrada'!$B$19+'Dados de Entrada'!$B$18,F$1<='Dados de Entrada'!$B$21),SUM(F16:F17),IF(F$1<'Dados de Entrada'!$B$19+'Dados de Entrada'!$B$18,0,\"\"))","v":0},{"$f":"IF(AND(G$1>='Dados de Entrada'!$B$19+'Dados de Entrada'!$B$18,G$1<='Dados de Entrada'!$B$21),SUM(G16:G17),IF(G$1<'Dados de Entrada'!$B$19+'Dados de Entrada'!$B$18,0,\"\"))","v":0},{"$f":"IF(AND(H$1>='Dados de Entrada'!$B$19+'Dados de Entrada'!$B$18,H$1<='Dados de Entrada'!$B$21),SUM(H16:H17),IF(H$1<'Dados de Entrada'!$B$19+'Dados de Entrada'!$B$18,0,\"\"))","v":0},{"$f":"IF(AND(I$1>='Dados de Entrada'!$B$19+'Dados de Entrada'!$B$18,I$1<='Dados de Entrada'!$B$21),SUM(I16:I17),IF(I$1<'Dados de Entrada'!$B$19+'Dados de Entrada'!$B$18,0,\"\"))","v":0},{"$f":"IF(AND(J$1>='Dados de Entrada'!$B$19+'Dados de Entrada'!$B$18,J$1<='Dados de Entrada'!$B$21),SUM(J16:J17),IF(J$1<'Dados de Entrada'!$B$19+'Dados de Entrada'!$B$18,0,\"\"))","v":0},{"$f":"IF(AND(K$1>='Dados de Entrada'!$B$19+'Dados de Entrada'!$B$18,K$1<='Dados de Entrada'!$B$21),SUM(K16:K17),IF(K$1<'Dados de Entrada'!$B$19+'Dados de Entrada'!$B$18,0,\"\"))","v":0},{"$f":"IF(AND(L$1>='Dados de Entrada'!$B$19+'Dados de Entrada'!$B$18,L$1<='Dados de Entrada'!$B$21),SUM(L16:L17),IF(L$1<'Dados de Entrada'!$B$19+'Dados de Entrada'!$B$18,0,\"\"))","v":0},{"$f":"IF(AND(M$1>='Dados de Entrada'!$B$19+'Dados de Entrada'!$B$18,M$1<='Dados de Entrada'!$B$21),SUM(M16:M17),IF(M$1<'Dados de Entrada'!$B$19+'Dados de Entrada'!$B$18,0,\"\"))","v":0},{"$f":"IF(AND(N$1>='Dados de Entrada'!$B$19+'Dados de Entrada'!$B$18,N$1<='Dados de Entrada'!$B$21),SUM(N16:N17),IF(N$1<'Dados de Entrada'!$B$19+'Dados de Entrada'!$B$18,0,\"\"))","v":0},{"$f":"IF(AND(O$1>='Dados de Entrada'!$B$19+'Dados de Entrada'!$B$18,O$1<='Dados de Entrada'!$B$21),SUM(O16:O17),IF(O$1<'Dados de Entrada'!$B$19+'Dados de Entrada'!$B$18,0,\"\"))","v":0},{"$f":"IF(AND(P$1>='Dados de Entrada'!$B$19+'Dados de Entrada'!$B$18,P$1<='Dados de Entrada'!$B$21),SUM(P16:P17),IF(P$1<'Dados de Entrada'!$B$19+'Dados de Entrada'!$B$18,0,\"\"))","v":0},{"$f":"IF(AND(Q$1>='Dados de Entrada'!$B$19+'Dados de Entrada'!$B$18,Q$1<='Dados de Entrada'!$B$21),SUM(Q16:Q17),IF(Q$1<'Dados de Entrada'!$B$19+'Dados de Entrada'!$B$18,0,\"\"))","v":0},{"$f":"IF(AND(R$1>='Dados de Entrada'!$B$19+'Dados de Entrada'!$B$18,R$1<='Dados de Entrada'!$B$21),SUM(R16:R17),IF(R$1<'Dados de Entrada'!$B$19+'Dados de Entrada'!$B$18,0,\"\"))","v":0},{"$f":"IF(AND(S$1>='Dados de Entrada'!$B$19+'Dados de Entrada'!$B$18,S$1<='Dados de Entrada'!$B$21),SUM(S16:S17),IF(S$1<'Dados de Entrada'!$B$19+'Dados de Entrada'!$B$18,0,\"\"))","v":0},{"$f":"IF(AND(T$1>='Dados de Entrada'!$B$19+'Dados de Entrada'!$B$18,T$1<='Dados de Entrada'!$B$21),SUM(T16:T17),IF(T$1<'Dados de Entrada'!$B$19+'Dados de Entrada'!$B$18,0,\"\"))","v":0},{"$f":"IF(AND(U$1>='Dados de Entrada'!$B$19+'Dados de Entrada'!$B$18,U$1<='Dados de Entrada'!$B$21),SUM(U16:U17),IF(U$1<'Dados de Entrada'!$B$19+'Dados de Entrada'!$B$18,0,\"\"))","v":0},{"$f":"IF(AND(V$1>='Dados de Entrada'!$B$19+'Dados de Entrada'!$B$18,V$1<='Dados de Entrada'!$B$21),SUM(V16:V17),IF(V$1<'Dados de Entrada'!$B$19+'Dados de Entrada'!$B$18,0,\"\"))","v":0},{"$f":"IF(AND(W$1>='Dados de Entrada'!$B$19+'Dados de Entrada'!$B$18,W$1<='Dados de Entrada'!$B$21),SUM(W16:W17),IF(W$1<'Dados de Entrada'!$B$19+'Dados de Entrada'!$B$18,0,\"\"))","v":0},{"$f":"IF(AND(X$1>='Dados de Entrada'!$B$19+'Dados de Entrada'!$B$18,X$1<='Dados de Entrada'!$B$21),SUM(X16:X17),IF(X$1<'Dados de Entrada'!$B$19+'Dados de Entrada'!$B$18,0,\"\"))","v":""},{"$f":"IF(AND(Y$1>='Dados de Entrada'!$B$19+'Dados de Entrada'!$B$18,Y$1<='Dados de Entrada'!$B$21),SUM(Y16:Y17),IF(Y$1<'Dados de Entrada'!$B$19+'Dados de Entrada'!$B$18,0,\"\"))","v":""},{"$f":"IF(AND(Z$1>='Dados de Entrada'!$B$19+'Dados de Entrada'!$B$18,Z$1<='Dados de Entrada'!$B$21),SUM(Z16:Z17),IF(Z$1<'Dados de Entrada'!$B$19+'Dados de Entrada'!$B$18,0,\"\"))","v":""},{"$f":"IF(AND(AA$1>='Dados de Entrada'!$B$19+'Dados de Entrada'!$B$18,AA$1<='Dados de Entrada'!$B$21),SUM(AA16:AA17),IF(AA$1<'Dados de Entrada'!$B$19+'Dados de Entrada'!$B$18,0,\"\"))","v":""},{"$f":"IF(AND(AB$1>='Dados de Entrada'!$B$19+'Dados de Entrada'!$B$18,AB$1<='Dados de Entrada'!$B$21),SUM(AB16:AB17),IF(AB$1<'Dados de Entrada'!$B$19+'Dados de Entrada'!$B$18,0,\"\"))","v":""},{"$f":"IF(AND(AC$1>='Dados de Entrada'!$B$19+'Dados de Entrada'!$B$18,AC$1<='Dados de Entrada'!$B$21),SUM(AC16:AC17),IF(AC$1<'Dados de Entrada'!$B$19+'Dados de Entrada'!$B$18,0,\"\"))","v":""},{"$f":"IF(AND(AD$1>='Dados de Entrada'!$B$19+'Dados de Entrada'!$B$18,AD$1<='Dados de Entrada'!$B$21),SUM(AD16:AD17),IF(AD$1<'Dados de Entrada'!$B$19+'Dados de Entrada'!$B$18,0,\"\"))","v":""},{"$f":"IF(AND(AE$1>='Dados de Entrada'!$B$19+'Dados de Entrada'!$B$18,AE$1<='Dados de Entrada'!$B$21),SUM(AE16:AE17),IF(AE$1<'Dados de Entrada'!$B$19+'Dados de Entrada'!$B$18,0,\"\"))","v":""},{"$f":"IF(AND(AF$1>='Dados de Entrada'!$B$19+'Dados de Entrada'!$B$18,AF$1<='Dados de Entrada'!$B$21),SUM(AF16:AF17),IF(AF$1<'Dados de Entrada'!$B$19+'Dados de Entrada'!$B$18,0,\"\"))","v":""},{"$f":"IF(AND(AG$1>='Dados de Entrada'!$B$19+'Dados de Entrada'!$B$18,AG$1<='Dados de Entrada'!$B$21),SUM(AG16:AG17),IF(AG$1<'Dados de Entrada'!$B$19+'Dados de Entrada'!$B$18,0,\"\"))","v":""},{"$f":"IF(AND(AH$1>='Dados de Entrada'!$B$19+'Dados de Entrada'!$B$18,AH$1<='Dados de Entrada'!$B$21),SUM(AH16:AH17),IF(AH$1<'Dados de Entrada'!$B$19+'Dados de Entrada'!$B$18,0,\"\"))","v":""},{"$f":"IF(AND(AI$1>='Dados de Entrada'!$B$19+'Dados de Entrada'!$B$18,AI$1<='Dados de Entrada'!$B$21),SUM(AI16:AI17),IF(AI$1<'Dados de Entrada'!$B$19+'Dados de Entrada'!$B$18,0,\"\"))","v":""},{"$f":"IF(AND(AJ$1>='Dados de Entrada'!$B$19+'Dados de Entrada'!$B$18,AJ$1<='Dados de Entrada'!$B$21),SUM(AJ16:AJ17),IF(AJ$1<'Dados de Entrada'!$B$19+'Dados de Entrada'!$B$18,0,\"\"))","v":""},{"$f":"IF(AND(AK$1>='Dados de Entrada'!$B$19+'Dados de Entrada'!$B$18,AK$1<='Dados de Entrada'!$B$21),SUM(AK16:AK17),IF(AK$1<'Dados de Entrada'!$B$19+'Dados de Entrada'!$B$18,0,\"\"))","v":""},{"$f":"IF(AND(AL$1>='Dados de Entrada'!$B$19+'Dados de Entrada'!$B$18,AL$1<='Dados de Entrada'!$B$21),SUM(AL16:AL17),IF(AL$1<'Dados de Entrada'!$B$19+'Dados de Entrada'!$B$18,0,\"\"))","v":""},{"$f":"IF(AND(AM$1>='Dados de Entrada'!$B$19+'Dados de Entrada'!$B$18,AM$1<='Dados de Entrada'!$B$21),SUM(AM16:AM17),IF(AM$1<'Dados de Entrada'!$B$19+'Dados de Entrada'!$B$18,0,\"\"))","v":""},{"$f":"IF(AND(AN$1>='Dados de Entrada'!$B$19+'Dados de Entrada'!$B$18,AN$1<='Dados de Entrada'!$B$21),SUM(AN16:AN17),IF(AN$1<'Dados de Entrada'!$B$19+'Dados de Entrada'!$B$18,0,\"\"))","v":""},{"$f":"IF(AND(AO$1>='Dados de Entrada'!$B$19+'Dados de Entrada'!$B$18,AO$1<='Dados de Entrada'!$B$21),SUM(AO16:AO17),IF(AO$1<'Dados de Entrada'!$B$19+'Dados de Entrada'!$B$18,0,\"\"))","v":""}]
["Opex associado à Energia Elétrica (2.2.2.1)",{"$f":"IF(AND(B$1>='Dados de Entrada'!$B$19+'Dados de Entrada'!$B$18,B$1<='Dados de Entrada'!$B$21),'Dados de Entrada'!$B$91,IF(B$1<'Dados de Entrada'!$B$19+'Dados de Entrada'!$B$18,0,\"\"))","v":0},{"$f":"IF(AND(C$1>='Dados de Entrada'!$B$19+'Dados de Entrada'!$B$18,C$1<='Dados de Entrada'!$B$21),'Dados de Entrada'!$B$91,IF(C$1<'Dados de Entrada'!$B$19+'Dados de Entrada'!$B$18,0,\"\"))","v":0},{"$f":"IF(AND(D$1>='Dados de Entrada'!$B$19+'Dados de Entrada'!$B$18,D$1<='Dados de Entrada'!$B$21),'Dados de Entrada'!$B$91,IF(D$1<'Dados de Entrada'!$B$19+'Dados de Entrada'!$B$18,0,\"\"))","v":0},{"$f":"IF(AND(E$1>='Dados de Entrada'!$B$19+'Dados de Entrada'!$B$18,E$1<='Dados de Entrada'!$B$21),'Dados de Entrada'!$B$91,IF(E$1<'Dados de Entrada'!$B$19+'Dados de Entrada'!$B$18,0,\"\"))","v":0},{"$f":"IF(AND(F$1>='Dados de Entrada'!$B$19+'Dados de Entrada'!$B$18,F$1<='Dados de Entrada'!$B$21),'Dados de Entrada'!$B$91,IF(F$1<'Dados de Entrada'!$B$19+'Dados de Entrada'!$B$18,0,\"\"))","v":0},{"$f":"IF(AND(G$1>='Dados de Entrada'!$B$19+'Dados de Entrada'!$B$18,G$1<='Dados de Entrada'!$B$21),'Dados de Entrada'!$B$91,IF(G$1<'Dados de Entrada'!$B$19+'Dados de Entrada'!$B$18,0,\"\"))","v":0},{"$f":"IF(AND(H$1>='Dados de Entrada'!$B$19+'Dados de Entrada'!$B$18,H$1<='Dados de Entrada'!$B$21),'Dados de Entrada'!$B$91,IF(H$1<'Dados de Entrada'!$B$19+'Dados de Entrada'!$B$18,0,\"\"))","v":0},{"$f":"IF(AND(I$1>='Dados de Entrada'!$B$19+'Dados de Entrada'!$B$18,I$1<='Dados de Entrada'!$B$21),'Dados de Entrada'!$B$91,IF(I$1<'Dados de Entrada'!$B$19+'Dados de Entrada'!$B$18,0,\"\"))","v":0},{"$f":"IF(AND(J$1>='Dados de Entrada'!$B$19+'Dados de Entrada'!$B$18,J$1<='Dados de Entrada'!$B$21),'Dados de Entrada'!$B$91,IF(J$1<'Dados de Entrada'!$B$19+'Dados de Entrada'!$B$18,0,\"\"))","v":0},{"$f":"IF(AND(K$1>='Dados de Entrada'!$B$19+'Dados de Entrada'!$B$18,K$1<='Dados de Entrada'!$B$21),'Dados de Entrada'!$B$91,IF(K$1<'Dados de Entrada'!$B$19+'Dados de Entrada'!$B$18,0,\"\"))","v":0},{"$f":"IF(AND(L$1>='Dados de Entrada'!$B$19+'Dados de Entrada'!$B$18,L$1<='Dados de Entrada'!$B$21),'Dados de Entrada'!$B$91,IF(L$1<'Dados de Entrada'!$B$19+'Dados de Entrada'!$B$18,0,\"\"))","v":0},{"$f":"IF(AND(M$1>='Dados de Entrada'!$B$19+'Dados de Entrada'!$B$18,M$1<='Dados de Entrada'!$B$21),'Dados de Entrada'!$B$91,IF(M$1<'Dados de Entrada'!$B$19+'Dados de Entrada'!$B$18,0,\"\"))","v":0},{"$f":"IF(AND(N$1>='Dados de Entrada'!$B$19+'Dados de Entrada'!$B$18,N$1<='Dados de Entrada'!$B$21),'Dados de Entrada'!$B$91,IF(N$1<'Dados de Entrada'!$B$19+'Dados de Entrada'!$B$18,0,\"\"))","v":0},{"$f":"IF(AND(O$1>='Dados de Entrada'!$B$19+'Dados de Entrada'!$B$18,O$1<='Dados de Entrada'!$B$21),'Dados de Entrada'!$B$91,IF(O$1<'Dados de Entrada'!$B$19+'Dados de Entrada'!$B$18,0,\"\"))","v":0},{"$f":"IF(AND(P$1>='Dados de Entrada'!$B$19+'Dados de Entrada'!$B$18,P$1<='Dados de Entrada'!$B$21),'Dados de Entrada'!$B$91,IF(P$1<'Dados de Entrada'!$B$19+'Dados de Entrada'!$B$18,0,\"\"))","v":0},{"$f":"IF(AND(Q$1>='Dados de Entrada'!$B$19+'Dados de Entrada'!$B$18,Q$1<='Dados de Entrada'!$B$21),'Dados de Entrada'!$B$91,IF(Q$1<'Dados de Entrada'!$B$19+'Dados de Entrada'!$B$18,0,\"\"))","v":0},{"$f":"IF(AND(R$1>='Dados de Entrada'!$B$19+'Dados de Entrada'!$B$18,R$1<='Dados de Entrada'!$B$21),'Dados de Entrada'!$B$91,IF(R$1<'Dados de Entrada'!$B$19+'Dados de Entrada'!$B$18,0,\"\"))","v":0},{"$f":"IF(AND(S$1>='Dados de Entrada'!$B$19+'Dados de Entrada'!$B$18,S$1<='Dados de Entrada'!$B$21),'Dados de Entrada'!$B$91,IF(S$1<'Dados de Entrada'!$B$19+'Dados de Entrada'!$B$18,0,\"\"))","v":0},{"$f":"IF(AND(T$1>='Dados de Entrada'!$B$19+'Dados de Entrada'!$B$18,T$1<='Dados de Entrada'!$B$21),'Dados de Entrada'!$B$91,IF(T$1<'Dados de Entrada'!$B$19+'Dados de Entrada'!$B$18,0,\"\"))","v":0},{"$f":"IF(AND(U$1>='Dados de Entrada'!$B$19+'Dados de Entrada'!$B$18,U$1<='Dados de Entrada'!$B$21),'Dados de Entrada'!$B$91,IF(U$1<'Dados de Entrada'!$B$19+'Dados de Entrada'!$B$18,0,\"\"))","v":0},{"$f":"IF(AND(V$1>='Dados de Entrada'!$B$19+'Dados de Entrada'!$B$18,V$1<='Dados de Entrada'!$B$21),'Dados de Entrada'!$B$91,IF(V$1<'Dados de Entrada'!$B$19+'Dados de Entrada'!$B$18,0,\"\"))","v":0},{"$f":"IF(AND(W$1>='Dados de Entrada'!$B$19+'Dados de Entrada'!$B$18,W$1<='Dados de Entrada'!$B$21),'Dados de Entrada'!$B$91,IF(W$1<'Dados de Entrada'!$B$19+'Dados de Entrada'!$B$18,0,\"\"))","v":0},{"$f":"IF(AND(X$1>='Dados de Entrada'!$B$19+'Dados de Entrada'!$B$18,X$1<='Dados de Entrada'!$B$21),'Dados de Entrada'!$B$91,IF(X$1<'Dados de Entrada'!$B$19+'Dados de Entrada'!$B$18,0,\"\"))","v":""},{"$f":"IF(AND(Y$1>='Dados de Entrada'!$B$19+'Dados de Entrada'!$B$18,Y$1<='Dados de Entrada'!$B$21),'Dados de Entrada'!$B$91,IF(Y$1<'Dados de Entrada'!$B$19+'Dados de Entrada'!$B$18,0,\"\"))","v":""},{"$f":"IF(AND(Z$1>='Dados de Entrada'!$B$19+'Dados de Entrada'!$B$18,Z$1<='Dados de Entrada'!$B$21),'Dados de Entrada'!$B$91,IF(Z$1<'Dados de Entrada'!$B$19+'Dados de Entrada'!$B$18,0,\"\"))","v":""},{"$f":"IF(AND(AA$1>='Dados de Entrada'!$B$19+'Dados de Entrada'!$B$18,AA$1<='Dados de Entrada'!$B$21),'Dados de Entrada'!$B$91,IF(AA$1<'Dados de Entrada'!$B$19+'Dados de Entrada'!$B$18,0,\"\"))","v":""},{"$f":"IF(AND(AB$1>='Dados de Entrada'!$B$19+'Dados de Entrada'!$B$18,AB$1<='Dados de Entrada'!$B$21),'Dados de Entrada'!$B$91,IF(AB$1<'Dados de Entrada'!$B$19+'Dados de Entrada'!$B$18,0,\"\"))","v":""},{"$f":"IF(AND(AC$1>='Dados de Entrada'!$B$19+'Dados de Entrada'!$B$18,AC$1<='Dados de Entrada'!$B$21),'Dados de Entrada'!$B$91,IF(AC$1<'Dados de Entrada'!$B$19+'Dados de Entrada'!$B$18,0,\"\"))","v":""},{"$f":"IF(AND(AD$1>='Dados de Entrada'!$B$19+'Dados de Entrada'!$B$18,AD$1<='Dados de Entrada'!$B$21),'Dados de Entrada'!$B$91,IF(AD$1<'Dados de Entrada'!$B$19+'Dados de Entrada'!$B$18,0,\"\"))","v":""},{"$f":"IF(AND(AE$1>='Dados de Entrada'!$B$19+'Dados de Entrada'!$B$18,AE$1<='Dados de Entrada'!$B$21),'Dados de Entrada'!$B$91,IF(AE$1<'Dados de Entrada'!$B$19+'Dados de Entrada'!$B$18,0,\"\"))","v":""},{"$f":"IF(AND(AF$1>='Dados de Entrada'!$B$19+'Dados de Entrada'!$B$18,AF$1<='Dados de Entrada'!$B$21),'Dados de Entrada'!$B$91,IF(AF$1<'Dados de Entrada'!$B$19+'Dados de Entrada'!$B$18,0,\"\"))","v":""},{"$f":"IF(AND(AG$1>='Dados de Entrada'!$B$19+'Dados de Entrada'!$B$18,AG$1<='Dados de Entrada'!$B$21),'Dados de Entrada'!$B$91,IF(AG$1<'Dados de Entrada'!$B$19+'Dados de Entrada'!$B$18,0,\"\"))","v":""},{"$f":"IF(AND(AH$1>='Dados de Entrada'!$B$19+'Dados de Entrada'!$B$18,AH$1<='Dados de Entrada'!$B$21),'Dados de Entrada'!$B$91,IF(AH$1<'Dados de Entrada'!$B$19+'Dados de Entrada'!$B$18,0,\"\"))","v":""},{"$f":"IF(AND(AI$1>='Dados de Entrada'!$B$19+'Dados de Entrada'!$B$18,AI$1<='Dados de Entrada'!$B$21),'Dados de Entrada'!$B$91,IF(AI$1<'Dados de Entrada'!$B$19+'Dados de Entrada'!$B$18,0,\"\"))","v":""},{"$f":"IF(AND(AJ$1>='Dados de Entrada'!$B$19+'Dados de Entrada'!$B$18,AJ$1<='Dados de Entrada'!$B$21),'Dados de Entrada'!$B$91,IF(AJ$1<'Dados de Entrada'!$B$19+'Dados de Entrada'!$B$18,0,\"\"))","v":""},{"$f":"IF(AND(AK$1>='Dados de Entrada'!$B$19+'Dados de Entrada'!$B$18,AK$1<='Dados de Entrada'!$B$21),'Dados de Entrada'!$B$91,IF(AK$1<'Dados de Entrada'!$B$19+'Dados de Entrada'!$B$18,0,\"\"))","v":""},{"$f":"IF(AND(AL$1>='Dados de Entrada'!$B$19+'Dados de Entrada'!$B$18,AL$1<='Dados de Entrada'!$B$21),'Dados de Entrada'!$B$91,IF(AL$1<'Dados de Entrada'!$B$19+'Dados de Entrada'!$B$18,0,\"\"))","v":""},{"$f":"IF(AND(AM$1>='Dados de Entrada'!$B$19+'Dados de Entrada'!$B$18,AM$1<='Dados de Entrada'!$B$21),'Dados de Entrada'!$B$91,IF(AM$1<'Dados de Entrada'!$B$19+'Dados de Entrada'!$B$18,0,\"\"))","v":""},{"$f":"IF(AND(AN$1>='Dados de Entrada'!$B$19+'Dados de Entrada'!$B$18,AN$1<='Dados de Entrada'!$B$21),'Dados de Entrada'!$B$91,IF(AN$1<'Dados de Entrada'!$B$19+'Dados de Entrada'!$B$18,0,\"\"))","v":""},{"$f":"IF(AND(AO$1>='Dados de Entrada'!$B$19+'Dados de Entrada'!$B$18,AO$1<='Dados de Entrada'!$B$21),'Dados de Entrada'!$B$91,IF(AO$1<'Dados de Entrada'!$B$19+'Dados de Entrada'!$B$18,0,\"\"))","v":""}]
["Opex associado a Outros custos operacionais (2.2.2.2)",{"$f":"IF(AND(B$1>='Dados de Entrada'!$B$19+'Dados de Entrada'!$B$18,B$1<='Dados de Entrada'!$B$21),'Dados de Entrada'!$B$93,IF(B$1<'Dados de Entrada'!$B$19+'Dados de Entrada'!$B$18,0,\"\"))","v":0},{"$f":"IF(AND(C$1>='Dados de Entrada'!$B$19+'Dados de Entrada'!$B$18,C$1<='Dados de Entrada'!$B$21),'Dados de Entrada'!$B$93,IF(C$1<'Dados de Entrada'!$B$19+'Dados de Entrada'!$B$18,0,\"\"))","v":0},{"$f":"IF(AND(D$1>='Dados de Entrada'!$B$19+'Dados de Entrada'!$B$18,D$1<='Dados de Entrada'!$B$21),'Dados de Entrada'!$B$93,IF(D$1<'Dados de Entrada'!$B$19+'Dados de Entrada'!$B$18,0,\"\"))","v":0},{"$f":"IF(AND(E$1>='Dados de Entrada'!$B$19+'Dados de Entrada'!$B$18,E$1<='Dados de Entrada'!$B$21),'Dados de Entrada'!$B$93,IF(E$1<'Dados de Entrada'!$B$19+'Dados de Entrada'!$B$18,0,\"\"))","v":0},{"$f":"IF(AND(F$1>='Dados de Entrada'!$B$19+'Dados de Entrada'!$B$18,F$1<='Dados de Entrada'!$B$21),'Dados de Entrada'!$B$93,IF(F$1<'Dados de Entrada'!$B$19+'Dados de Entrada'!$B$18,0,\"\"))","v":0},{"$f":"IF(AND(G$1>='Dados de Entrada'!$B$19+'Dados de Entrada'!$B$18,G$1<='Dados de Entrada'!$B$21),'Dados de Entrada'!$B$93,IF(G$1<'Dados de Entrada'!$B$19+'Dados de Entrada'!$B$18,0,\"\"))","v":0},{"$f":"IF(AND(H$1>='Dados de Entrada'!$B$19+'Dados de Entrada'!$B$18,H$1<='Dados de Entrada'!$B$21),'Dados de Entrada'!$B$93,IF(H$1<'Dados de Entrada'!$B$19+'Dados de Entrada'!$B$18,0,\"\"))","v":0},{"$f":"IF(AND(I$1>='Dados de Entrada'!$B$19+'Dados de Entrada'!$B$18,I$1<='Dados de Entrada'!$B$21),'Dados de Entrada'!$B$93,IF(I$1<'Dados de Entrada'!$B$19+'Dados de Entrada'!$B$18,0,\"\"))","v":0},{"$f":"IF(AND(J$1>='Dados de Entrada'!$B$19+'Dados de Entrada'!$B$18,J$1<='Dados de Entrada'!$B$21),'Dados de Entrada'!$B$93,IF(J$1<'Dados de Entrada'!$B$19+'Dados de Entrada'!$B$18,0,\"\"))","v":0},{"$f":"IF(AND(K$1>='Dados de Entrada'!$B$19+'Dados de Entrada'!$B$18,K$1<='Dados de Entrada'!$B$21),'Dados de Entrada'!$B$93,IF(K$1<'Dados de Entrada'!$B$19+'Dados de Entrada'!$B$18,0,\"\"))","v":0},{"$f":"IF(AND(L$1>='Dados de Entrada'!$B$19+'Dados de Entrada'!$B$18,L$1<='Dados de Entrada'!$B$21),'Dados de Entrada'!$B$93,IF(L$1<'Dados de Entrada'!$B$19+'Dados de Entrada'!$B$18,0,\"\"))","v":0},{"$f":"IF(AND(M$1>='Dados de Entrada'!$B$19+'Dados de Entrada'!$B$18,M$1<='Dados de Entrada'!$B$21),'Dados de Entrada'!$B$93,IF(M$1<'Dados de Entrada'!$B$19+'Dados de Entrada'!$B$18,0,\"\"))","v":0},{"$f":"IF(AND(N$1>='Dados de Entrada'!$B$19+'Dados de Entrada'!$B$18,N$1<='Dados de Entrada'!$B$21),'Dados de Entrada'!$B$93,IF(N$1<'Dados de Entrada'!$B$19+'Dados de Entrada'!$B$18,0,\"\"))","v":0},{"$f":"IF(AND(O$1>='Dados de Entrada'!$B$19+'Dados de Entrada'!$B$18,O$1<='Dados de Entrada'!$B$21),'Dados de Entrada'!$B$93,IF(O$1<'Dados de Entrada'!$B$19+'Dados de Entrada'!$B$18,0,\"\"))","v":0},{"$f":"IF(AND(P$1>='Dados de Entrada'!$B$19+'Dados de Entrada'!$B$18,P$1<='Dados de Entrada'!$B$21),'Dados de Entrada'!$B$93,IF(P$1<'Dados de Entrada'!$B$19+'Dados de Entrada'!$B$18,0,\"\"))","v":0},{"$f":"IF(AND(Q$1>='Dados de Entrada'!$B$19+'Dados de Entrada'!$B$18,Q$1<='Dados de Entrada'!$B$21),'Dados de Entrada'!$B$93,IF(Q$1<'Dados de Entrada'!$B$19+'Dados de Entrada'!$B$18,0,\"\"))","v":0},{"$f":"IF(AND(R$1>='Dados de Entrada'!$B$19+'Dados de Entrada'!$B$18,R$1<='Dados de Entrada'!$B$21),'Dados de Entrada'!$B$93,IF(R$1<'Dados de Entrada'!$B$19+'Dados de Entrada'!$B$18,0,\"\"))","v":0},{"$f":"IF(AND(S$1>='Dados de Entrada'!$B$19+'Dados de Entrada'!$B$18,S$1<='Dados de Entrada'!$B$21),'Dados de Entrada'!$B$93,IF(S$1<'Dados de Entrada'!$B$19+'Dados de Entrada'!$B$18,0,\"\"))","v":0},{"$f":"IF(AND(T$1>='Dados de Entrada'!$B$19+'Dados de Entrada'!$B$18,T$1<='Dados de Entrada'!$B$21),'Dados de Entrada'!$B$93,IF(T$1<'Dados de Entrada'!$B$19+'Dados de Entrada'!$B$18,0,\"\"))","v":0},{"$f":"IF(AND(U$1>='Dados de Entrada'!$B$19+'Dados de Entrada'!$B$18,U$1<='Dados de Entrada'!$B$21),'Dados de Entrada'!$B$93,IF(U$1<'Dados de Entrada'!$B$19+'Dados de Entrada'!$B$18,0,\"\"))","v":0},{"$f":"IF(AND(V$1>='Dados de Entrada'!$B$19+'Dados de Entrada'!$B$18,V$1<='Dados de Entrada'!$B$21),'Dados de Entrada'!$B$93,IF(V$1<'Dados de Entrada'!$B$19+'Dados de Entrada'!$B$18,0,\"\"))","v":0},{"$f":"IF(AND(W$1>='Dados de Entrada'!$B$19+'Dados de Entrada'!$B$18,W$1<='Dados de Entrada'!$B$21),'Dados de Entrada'!$B$93,IF(W$1<'Dados de Entrada'!$B$19+'Dados de Entrada'!$B$18,0,\"\"))","v":0},{"$f":"IF(AND(X$1>='Dados de Entrada'!$B$19+'Dados de Entrada'!$B$18,X$1<='Dados de Entrada'!$B$21),'Dados de Entrada'!$B$93,IF(X$1<'Dados de Entrada'!$B$19+'Dados de Entrada'!$B$18,0,\"\"))","v":""},{"$f":"IF(AND(Y$1>='Dados de Entrada'!$B$19+'Dados de Entrada'!$B$18,Y$1<='Dados de Entrada'!$B$21),'Dados de Entrada'!$B$93,IF(Y$1<'Dados de Entrada'!$B$19+'Dados de Entrada'!$B$18,0,\"\"))","v":""},{"$f":"IF(AND(Z$1>='Dados de Entrada'!$B$19+'Dados de Entrada'!$B$18,Z$1<='Dados de Entrada'!$B$21),'Dados de Entrada'!$B$93,IF(Z$1<'Dados de Entrada'!$B$19+'Dados de Entrada'!$B$18,0,\"\"))","v":""},{"$f":"IF(AND(AA$1>='Dados de Entrada'!$B$19+'Dados de Entrada'!$B$18,AA$1<='Dados de Entrada'!$B$21),'Dados de Entrada'!$B$93,IF(AA$1<'Dados de Entrada'!$B$19+'Dados de Entrada'!$B$18,0,\"\"))","v":""},{"$f":"IF(AND(AB$1>='Dados de Entrada'!$B$19+'Dados de Entrada'!$B$18,AB$1<='Dados de Entrada'!$B$21),'Dados de Entrada'!$B$93,IF(AB$1<'Dados de Entrada'!$B$19+'Dados de Entrada'!$B$18,0,\"\"))","v":""},{"$f":"IF(AND(AC$1>='Dados de Entrada'!$B$19+'Dados de Entrada'!$B$18,AC$1<='Dados de Entrada'!$B$21),'Dados de Entrada'!$B$93,IF(AC$1<'Dados de Entrada'!$B$19+'Dados de Entrada'!$B$18,0,\"\"))","v":""},{"$f":"IF(AND(AD$1>='Dados de Entrada'!$B$19+'Dados de Entrada'!$B$18,AD$1<='Dados de Entrada'!$B$21),'Dados de Entrada'!$B$93,IF(AD$1<'Dados de Entrada'!$B$19+'Dados de Entrada'!$B$18,0,\"\"))","v":""},{"$f":"IF(AND(AE$1>='Dados de Entrada'!$B$19+'Dados de Entrada'!$B$18,AE$1<='Dados de Entrada'!$B$21),'Dados de Entrada'!$B$93,IF(AE$1<'Dados de Entrada'!$B$19+'Dados de Entrada'!$B$18,0,\"\"))","v":""},{"$f":"IF(AND(AF$1>='Dados de Entrada'!$B$19+'Dados de Entrada'!$B$18,AF$1<='Dados de Entrada'!$B$21),'Dados de Entrada'!$B$93,IF(AF$1<'Dados de Entrada'!$B$19+'Dados de Entrada'!$B$18,0,\"\"))","v":""},{"$f":"IF(AND(AG$1>='Dados de Entrada'!$B$19+'Dados de Entrada'!$B$18,AG$1<='Dados de Entrada'!$B$21),'Dados de Entrada'!$B$93,IF(AG$1<'Dados de Entrada'!$B$19+'Dados de Entrada'!$B$18,0,\"\"))","v":""},{"$f":"IF(AND(AH$1>='Dados de Entrada'!$B$19+'Dados de Entrada'!$B$18,AH$1<='Dados de Entrada'!$B$21),'Dados de Entrada'!$B$93,IF(AH$1<'Dados de Entrada'!$B$19+'Dados de Entrada'!$B$18,0,\"\"))","v":""},{"$f":"IF(AND(AI$1>='Dados de Entrada'!$B$19+'Dados de Entrada'!$B$18,AI$1<='Dados de Entrada'!$B$21),'Dados de Entrada'!$B$93,IF(AI$1<'Dados de Entrada'!$B$19+'Dados de Entrada'!$B$18,0,\"\"))","v":""},{"$f":"IF(AND(AJ$1>='Dados de Entrada'!$B$19+'Dados de Entrada'!$B$18,AJ$1<='Dados de Entrada'!$B$21),'Dados de Entrada'!$B$93,IF(AJ$1<'Dados de Entrada'!$B$19+'Dados de Entrada'!$B$18,0,\"\"))","v":""},{"$f":"IF(AND(AK$1>='Dados de Entrada'!$B$19+'Dados de Entrada'!$B$18,AK$1<='Dados de Entrada'!$B$21),'Dados de Entrada'!$B$93,IF(AK$1<'Dados de Entrada'!$B$19+'Dados de Entrada'!$B$18,0,\"\"))","v":""},{"$f":"IF(AND(AL$1>='Dados de Entrada'!$B$19+'Dados de Entrada'!$B$18,AL$1<='Dados de Entrada'!$B$21),'Dados de Entrada'!$B$93,IF(AL$1<'Dados de Entrada'!$B$19+'Dados de Entrada'!$B$18,0,\"\"))","v":""},{"$f":"IF(AND(AM$1>='Dados de Entrada'!$B$19+'Dados de Entrada'!$B$18,AM$1<='Dados de Entrada'!$B$21),'Dados de Entrada'!$B$93,IF(AM$1<'Dados de Entrada'!$B$19+'Dados de Entrada'!$B$18,0,\"\"))","v":""},{"$f":"IF(AND(AN$1>='Dados de Entrada'!$B$19+'Dados de Entrada'!$B$18,AN$1<='Dados de Entrada'!$B$21),'Dados de Entrada'!$B$93,IF(AN$1<'Dados de Entrada'!$B$19+'Dados de Entrada'!$B$18,0,\"\"))","v":""},{"$f":"IF(AND(AO$1>='Dados de Entrada'!$B$19+'Dados de Entrada'!$B$18,AO$1<='Dados de Entrada'!$B$21),'Dados de Entrada'!$B$93,IF(AO$1<'Dados de Entrada'!$B$19+'Dados de Entrada'!$B$18,0,\"\"))","v":""}]
["EBITDA (3) = (1) - (2)",{"$f":"IFERROR(B3-B4,\"\")","v":0},0,858096.33031057101,858096.33031057101,858096.33031057101,858096.33031057101,858096.33031057101,858096.33031057101,858096.33031057101,858096.33031057101,858096.33031057101,858096.33031057101,858096.33031057101,858096.33031057101,858096.33031057101,858096.33031057101,858096.33031057101,858096.33031057101,858096.33031057101,858096.33031057101,858096.33031057101,858096.33031057101,"","","","","","","","","","","","","","","","","",""]
["Depreciação Total (4) = (4.1) + (4.2)",{"$f":"IF(AND(B$1>='Dados de Entrada'!$B$19+'Dados de Entrada'!$B$18,B$1<='Dados de Entrada'!$B$21),SUM(B20:B21),IF(B$1<'Dados de Entrada'!$B$19+'Dados de Entrada'!$B$18,0,\"\"))","v":0},{"$f":"IF(AND(C$1>='Dados de Entrada'!$B$19+'Dados de Entrada'!$B$18,C$1<='Dados de Entrada'!$B$21),SUM(C20:C21),IF(C$1<'Dados de Entrada'!$B$19+'Dados de Entrada'!$B$18,0,\"\"))","v":0},{"$f":"IF(AND(D$1>='Dados de Entrada'!$B$19+'Dados de Entrada'!$B$18,D$1<='Dados de Entrada'!$B$21),SUM(D20:D21),IF(D$1<'Dados de Entrada'!$B$19+'Dados de Entrada'!$B$18,0,\"\"))","v":355299.74679282482},{"$f":"IF(AND(E$1>='Dados de Entrada'!$B$19+'Dados de Entrada'!$B$18,E$1<='Dados de Entrada'!$B$21),SUM(E20:E21),IF(E$1<'Dados de Entrada'!$B$19+'Dados de Entrada'!$B$18,0,\"\"))","v":355299.74679282482},{"$f":"IF(AND(F$1>='Dados de Entrada'!$B$19+'Dados de Entrada'!$B$18,F$1<='Dados de Entrada'!$B$21),SUM(F20:F21),IF(F$1<'Dados de Entrada'!$B$19+'Dados de Entrada'!$B$18,0,\"\"))","v":355299.74679282482},{"$f":"IF(AND(G$1>='Dados de Entrada'!$B$19+'Dados de Entrada'!$B$18,G$1<='Dados de Entrada'!$B$21),SUM(G20:G21),IF(G$1<'Dados de Entrada'!$B$19+'Dados de Entrada'!$B$18,0,\"\"))","v":355299.74679282482},{"$f":"IF(AND(H$1>='Dados de Entrada'!$B$19+'Dados de Entrada'!$B$18,H$1<='Dados de Entrada'!$B$21),SUM(H20:H21),IF(H$1<'Dados de Entrada'!$B$19+'Dados de Entrada'!$B$18,0,\"\"))","v":355299.74679282482},{"$f":"IF(AND(I$1>='Dados de Entrada'!$B$19+'Dados de Entrada'!$B$18,I$1<='Dados de Entrada'!$B$21),SUM(I20:I21),IF(I$1<'Dados de Entrada'!$B$19+'Dados de Entrada'!$B$18,0,\"\"))","v":355299.74679282482},{"$f":"IF(AND(J$1>='Dados de Entrada'!$B$19+'Dados de Entrada'!$B$18,J$1<='Dados de Entrada'!$B$21),SUM(J20:J21),IF(J$1<'Dados de Entrada'!$B$19+'Dados de Entrada'!$B$18,0,\"\"))","v":355299.74679282482},{"$f":"IF(AND(K$1>='Dados de Entrada'!$B$19+'Dados de Entrada'!$B$18,K$1<='Dados de Entrada'!$B$21),SUM(K20:K21),IF(K$1<'Dados de Entrada'!$B$19+'Dados de Entrada'!$B$18,0,\"\"))","v":355299.74679282482},{"$f":"IF(AND(L$1>='Dados de Entrada'!$B$19+'Dados de Entrada'!$B$18,L$1<='Dados de Entrada'!$B$21),SUM(L20:L21),IF(L$1<'Dados de Entrada'!$B$19+'Dados de Entrada'!$B$18,0,\"\"))","v":355299.74679282482},{"$f":"IF(AND(M$1>='Dados de Entrada'!$B$19+'Dados de Entrada'!$B$18,M$1<='Dados de Entrada'!$B$21),SUM(M20:M21),IF(M$1<'Dados de Entrada'!$B$19+'Dados de Entrada'!$B$18,0,\"\"))","v":355299.74679282482},{"$f":"IF(AND(N$1>='Dados de Entrada'!$B$19+'Dados de Entrada'!$B$18,N$1<='Dados de Entrada'!$B$21),SUM(N20:N21),IF(N$1<'Dados de Entrada'!$B$19+'Dados de Entrada'!$B$18,0,\"\"))","v":355299.74679282482},{"$f":"IF(AND(O$1>='Dados de Entrada'!$B$19+'Dados de Entrada'!$B$18,O$1<='Dados de Entrada'!$B$21),SUM(O20:O21),IF(O$1<'Dados de Entrada'!$B$19+'Dados de Entrada'!$B$18,0,\"\"))","v":355299.74679282482},{"$f":"IF(AND(P$1>='Dados de Entrada'!$B$19+'Dados de Entrada'!$B$18,P$1<='Dados de Entrada'!$B$21),SUM(P20:P21),IF(P$1<'Dados de Entrada'!$B$19+'Dados de Entrada'!$B$18,0,\"\"))","v":355299.74679282482},{"$f":"IF(AND(Q$1>='Dados de Entrada'!$B$19+'Dados de Entrada'!$B$18,Q$1<='Dados de Entrada'!$B$21),SUM(Q20:Q21),IF(Q$1<'Dados de Entrada'!$B$19+'Dados de Entrada'!$B$18,0,\"\"))","v":355299.74679282482},{"$f":"IF(AND(R$1>='Dados de Entrada'!$B$19+'Dados de Entrada'!$B$18,R$1<='Dados de Entrada'!$B$21),SUM(R20:R21),IF(R$1<'Dados de Entrada'!$B$19+'Dados de Entrada'!$B$18,0,\"\"))","v":355299.74679282482},{"$f":"IF(AND(S$1>='Dados de Entrada'!$B$19+'Dados de Entrada'!$B$18,S$1<='Dados de Entrada'!$B$21),SUM(S20:S21),IF(S$1<'Dados de Entrada'!$B$19+'Dados de Entrada'!$B$18,0,\"\"))","v":355299.74679282482},{"$f":"IF(AND(T$1>='Dados de Entrada'!$B$19+'Dados de Entrada'!$B$18,T$1<='Dados de Entrada'!$B$21),SUM(T20:T21),IF(T$1<'Dados de Entrada'!$B$19+'Dados de Entrada'!$B$18,0,\"\"))","v":355299.74679282482},{"$f":"IF(AND(U$1>='Dados de Entrada'!$B$19+'Dados de Entrada'!$B$18,U$1<='Dados de Entrada'!$B$21),SUM(U20:U21),IF(U$1<'Dados de Entrada'!$B$19+'Dados de Entrada'!$B$18,0,\"\"))","v":355299.74679282482},{"$f":"IF(AND(V$1>='Dados de Entrada'!$B$19+'Dados de Entrada'!$B$18,V$1<='Dados de Entrada'!$B$21),SUM(V20:V21),IF(V$1<'Dados de Entrada'!$B$19+'Dados de Entrada'!$B$18,0,\"\"))","v":355299.74679282482},{"$f":"IF(AND(W$1>='Dados de Entrada'!$B$19+'Dados de Entrada'!$B$18,W$1<='Dados de Entrada'!$B$21),SUM(W20:W21),IF(W$1<'Dados de Entrada'!$B$19+'Dados de Entrada'!$B$18,0,\"\"))","v":355299.74679282482},{"$f":"IF(AND(X$1>='Dados de Entrada'!$B$19+'Dados de Entrada'!$B$18,X$1<='Dados de Entrada'!$B$21),SUM(X20:X21),IF(X$1<'Dados de Entrada'!$B$19+'Dados de Entrada'!$B$18,0,\"\"))","v":""},{"$f":"IF(AND(Y$1>='Dados de Entrada'!$B$19+'Dados de Entrada'!$B$18,Y$1<='Dados de Entrada'!$B$21),SUM(Y20:Y21),IF(Y$1<'Dados de Entrada'!$B$19+'Dados de Entrada'!$B$18,0,\"\"))","v":""},{"$f":"IF(AND(Z$1>='Dados de Entrada'!$B$19+'Dados de Entrada'!$B$18,Z$1<='Dados de Entrada'!$B$21),SUM(Z20:Z21),IF(Z$1<'Dados de Entrada'!$B$19+'Dados de Entrada'!$B$18,0,\"\"))","v":""},{"$f":"IF(AND(AA$1>='Dados de Entrada'!$B$19+'Dados de Entrada'!$B$18,AA$1<='Dados de Entrada'!$B$21),SUM(AA20:AA21),IF(AA$1<'Dados de Entrada'!$B$19+'Dados de Entrada'!$B$18,0,\"\"))","v":""},{"$f":"IF(AND(AB$1>='Dados de Entrada'!$B$19+'Dados de Entrada'!$B$18,AB$1<='Dados de Entrada'!$B$21),SUM(AB20:AB21),IF(AB$1<'Dados de Entrada'!$B$19+'Dados de Entrada'!$B$18,0,\"\"))","v":""},{"$f":"IF(AND(AC$1>='Dados de Entrada'!$B$19+'Dados de Entrada'!$B$18,AC$1<='Dados de Entrada'!$B$21),SUM(AC20:AC21),IF(AC$1<'Dados de Entrada'!$B$19+'Dados de Entrada'!$B$18,0,\"\"))","v":""},{"$f":"IF(AND(AD$1>='Dados de Entrada'!$B$19+'Dados de Entrada'!$B$18,AD$1<='Dados de Entrada'!$B$21),SUM(AD20:AD21),IF(AD$1<'Dados de Entrada'!$B$19+'Dados de Entrada'!$B$18,0,\"\"))","v":""},{"$f":"IF(AND(AE$1>='Dados de Entrada'!$B$19+'Dados de Entrada'!$B$18,AE$1<='Dados de Entrada'!$B$21),SUM(AE20:AE21),IF(AE$1<'Dados de Entrada'!$B$19+'Dados de Entrada'!$B$18,0,\"\"))","v":""},{"$f":"IF(AND(AF$1>='Dados de Entrada'!$B$19+'Dados de Entrada'!$B$18,AF$1<='Dados de Entrada'!$B$21),SUM(AF20:AF21),IF(AF$1<'Dados de Entrada'!$B$19+'Dados de Entrada'!$B$18,0,\"\"))","v":""},{"$f":"IF(AND(AG$1>='Dados de Entrada'!$B$19+'Dados de Entrada'!$B$18,AG$1<='Dados de Entrada'!$B$21),SUM(AG20:AG21),IF(AG$1<'Dados de Entrada'!$B$19+'Dados de Entrada'!$B$18,0,\"\"))","v":""},{"$f":"IF(AND(AH$1>='Dados de Entrada'!$B$19+'Dados de Entrada'!$B$18,AH$1<='Dados de Entrada'!$B$21),SUM(AH20:AH21),IF(AH$1<'Dados de Entrada'!$B$19+'Dados de Entrada'!$B$18,0,\"\"))","v":""},{"$f":"IF(AND(AI$1>='Dados de Entrada'!$B$19+'Dados de Entrada'!$B$18,AI$1<='Dados de Entrada'!$B$21),SUM(AI20:AI21),IF(AI$1<'Dados de Entrada'!$B$19+'Dados de Entrada'!$B$18,0,\"\"))","v":""},{"$f":"IF(AND(AJ$1>='Dados de Entrada'!$B$19+'Dados de Entrada'!$B$18,AJ$1<='Dados de Entrada'!$B$21),SUM(AJ20:AJ21),IF(AJ$1<'Dados de Entrada'!$B$19+'Dados de Entrada'!$B$18,0,\"\"))","v":""},{"$f":"IF(AND(AK$1>='Dados de Entrada'!$B$19+'Dados de Entrada'!$B$18,AK$1<='Dados de Entrada'!$B$21),SUM(AK20:AK21),IF(AK$1<'Dados de Entrada'!$B$19+'Dados de Entrada'!$B$18,0,\"\"))","v":""},{"$f":"IF(AND(AL$1>='Dados de Entrada'!$B$19+'Dados de Entrada'!$B$18,AL$1<='Dados de Entrada'!$B$21),SUM(AL20:AL21),IF(AL$1<'Dados de Entrada'!$B$19+'Dados de Entrada'!$B$18,0,\"\"))","v":""},{"$f":"IF(AND(AM$1>='Dados de Entrada'!$B$19+'Dados de Entrada'!$B$18,AM$1<='Dados de Entrada'!$B$21),SUM(AM20:AM21),IF(AM$1<'Dados de Entrada'!$B$19+'Dados de Entrada'!$B$18,0,\"\"))","v":""},{"$f":"IF(AND(AN$1>='Dados de Entrada'!$B$19+'Dados de Entrada'!$B$18,AN$1<='Dados de Entrada'!$B$21),SUM(AN20:AN21),IF(AN$1<'Dados de Entrada'!$B$19+'Dados de Entrada'!$B$18,0,\"\"))","v":""},{"$f":"IF(AND(AO$1>='Dados de Entrada'!$B$19+'Dados de Entrada'!$B$18,AO$1<='Dados de Entrada'!$B$21),SUM(AO20:AO21),IF(AO$1<'Dados de Entrada'!$B$19+'Dados de Entrada'!$B$18,0,\"\"))","v":""}]
["Depreciação do Capex da Produção (4.1)",{"$f":"IF(AND(B$1>='Dados de Entrada'!$B$19+'Dados de Entrada'!$B$18,B$1<='Dados de Entrada'!$B$21),'Dados de Entrada'!$B$35/'Dados de Entrada'!$B$20,IF(B$1<'Dados de Entrada'!$B$19+'Dados de Entrada'!$B$18,0,\"\"))","v":0},{"$f":"IF(AND(C$1>='Dados de Entrada'!$B$19+'Dados de Entrada'!$B$18,C$1<='Dados de Entrada'!$B$21),'Dados de Entrada'!$B$35/'Dados de Entrada'!$B$20,IF(C$1<'Dados de Entrada'!$B$19+'Dados de Entrada'!$B$18,0,\"\"))","v":0},{"$f":"IF(AND(D$1>='Dados de Entrada'!$B$19+'Dados de Entrada'!$B$18,D$1<='Dados de Entrada'!$B$21),'Dados de Entrada'!$B$35/'Dados de Entrada'!$B$20,IF(D$1<'Dados de Entrada'!$B$19+'Dados de Entrada'!$B$18,0,\"\"))","v":355299.74679282482},{"$f":"IF(AND(E$1>='Dados de Entrada'!$B$19+'Dados de Entrada'!$B$18,E$1<='Dados de Entrada'!$B$21),'Dados de Entrada'!$B$35/'Dados de Entrada'!$B$20,IF(E$1<'Dados de Entrada'!$B$19+'Dados de Entrada'!$B$18,0,\"\"))","v":355299.74679282482},{"$f":"IF(AND(F$1>='Dados de Entrada'!$B$19+'Dados de Entrada'!$B$18,F$1<='Dados de Entrada'!$B$21),'Dados de Entrada'!$B$35/'Dados de Entrada'!$B$20,IF(F$1<'Dados de Entrada'!$B$19+'Dados de Entrada'!$B$18,0,\"\"))","v":355299.74679282482},{"$f":"IF(AND(G$1>='Dados de Entrada'!$B$19+'Dados de Entrada'!$B$18,G$1<='Dados de Entrada'!$B$21),'Dados de Entrada'!$B$35/'Dados de Entrada'!$B$20,IF(G$1<'Dados de Entrada'!$B$19+'Dados de Entrada'!$B$18,0,\"\"))","v":355299.74679282482},{"$f":"IF(AND(H$1>='Dados de Entrada'!$B$19+'Dados de Entrada'!$B$18,H$1<='Dados de Entrada'!$B$21),'Dados de Entrada'!$B$35/'Dados de Entrada'!$B$20,IF(H$1<'Dados de Entrada'!$B$19+'Dados de Entrada'!$B$18,0,\"\"))","v":355299.74679282482},{"$f":"IF(AND(I$1>='Dados de Entrada'!$B$19+'Dados de Entrada'!$B$18,I$1<='Dados de Entrada'!$B$21),'Dados de Entrada'!$B$35/'Dados de Entrada'!$B$20,IF(I$1<'Dados de Entrada'!$B$19+'Dados de Entrada'!$B$18,0,\"\"))","v":355299.74679282482},{"$f":"IF(AND(J$1>='Dados de Entrada'!$B$19+'Dados de Entrada'!$B$18,J$1<='Dados de Entrada'!$B$21),'Dados de Entrada'!$B$35/'Dados de Entrada'!$B$20,IF(J$1<'Dados de Entrada'!$B$19+'Dados de Entrada'!$B$18,0,\"\"))","v":355299.74679282482},{"$f":"IF(AND(K$1>='Dados de Entrada'!$B$19+'Dados de Entrada'!$B$18,K$1<='Dados de Entrada'!$B$21),'Dados de Entrada'!$B$35/'Dados de Entrada'!$B$20,IF(K$1<'Dados de Entrada'!$B$19+'Dados de Entrada'!$B$18,0,\"\"))","v":355299.74679282482},{"$f":"IF(AND(L$1>='Dados de Entrada'!$B$19+'Dados de Entrada'!$B$18,L$1<='Dados de Entrada'!$B$21),'Dados de Entrada'!$B$35/'Dados de Entrada'!$B$20,IF(L$1<'Dados de Entrada'!$B$19+'Dados de Entrada'!$B$18,0,\"\"))","v":355299.74679282482},{"$f":"IF(AND(M$1>='Dados de Entrada'!$B$19+'Dados de Entrada'!$B$18,M$1<='Dados de Entrada'!$B$21),'Dados de Entrada'!$B$35/'Dados de Entrada'!$B$20,IF(M$1<'Dados de Entrada'!$B$19+'Dados de Entrada'!$B$18,0,\"\"))","v":355299.74679282482},{"$f":"IF(AND(N$1>='Dados de Entrada'!$B$19+'Dados de Entrada'!$B$18,N$1<='Dados de Entrada'!$B$21),'Dados de Entrada'!$B$35/'Dados de Entrada'!$B$20,IF(N$1<'Dados de Entrada'!$B$19+'Dados de Entrada'!$B$18,0,\"\"))","v":355299.74679282482},{"$f":"IF(AND(O$1>='Dados de Entrada'!$B$19+'Dados de Entrada'!$B$18,O$1<='Dados de Entrada'!$B$21),'Dados de Entrada'!$B$35/'Dados de Entrada'!$B$20,IF(O$1<'Dados de Entrada'!$B$19+'Dados de Entrada'!$B$18,0,\"\"))","v":355299.74679282482},{"$f":"IF(AND(P$1>='Dados de Entrada'!$B$19+'Dados de Entrada'!$B$18,P$1<='Dados de Entrada'!$B$21),'Dados de Entrada'!$B$35/'Dados de Entrada'!$B$20,IF(P$1<'Dados de Entrada'!$B$19+'Dados de Entrada'!$B$18,0,\"\"))","v":355299.74679282482},{"$f":"IF(AND(Q$1>='Dados de Entrada'!$B$19+'Dados de Entrada'!$B$18,Q$1<='Dados de Entrada'!$B$21),'Dados de Entrada'!$B$35/'Dados de Entrada'!$B$20,IF(Q$1<'Dados de Entrada'!$B$19+'Dados de Entrada'!$B$18,0,\"\"))","v":355299.74679282482},{"$f":"IF(AND(R$1>='Dados de Entrada'!$B$19+'Dados de Entrada'!$B$18,R$1<='Dados de Entrada'!$B$21),'Dados de Entrada'!$B$35/'Dados de Entrada'!$B$20,IF(R$1<'Dados de Entrada'!$B$19+'Dados de Entrada'!$B$18,0,\"\"))","v":355299.74679282482},{"$f":"IF(AND(S$1>='Dados de Entrada'!$B$19+'Dados de Entrada'!$B$18,S$1<='Dados de Entrada'!$B$21),'Dados de Entrada'!$B$35/'Dados de Entrada'!$B$20,IF(S$1<'Dados de Entrada'!$B$19+'Dados de Entrada'!$B$18,0,\"\"))","v":355299.74679282482},{"$f":"IF(AND(T$1>='Dados de Entrada'!$B$19+'Dados de Entrada'!$B$18,T$1<='Dados de Entrada'!$B$21),'Dados de Entrada'!$B$35/'Dados de Entrada'!$B$20,IF(T$1<'Dados de Entrada'!$B$19+'Dados de Entrada'!$B$18,0,\"\"))","v":355299.74679282482},{"$f":"IF(AND(U$1>='Dados de Entrada'!$B$19+'Dados de Entrada'!$B$18,U$1<='Dados de Entrada'!$B$21),'Dados de Entrada'!$B$35/'Dados de Entrada'!$B$20,IF(U$1<'Dados de Entrada'!$B$19+'Dados de Entrada'!$B$18,0,\"\"))","v":355299.74679282482},{"$f":"IF(AND(V$1>='Dados de Entrada'!$B$19+'Dados de Entrada'!$B$18,V$1<='Dados de Entrada'!$B$21),'Dados de Entrada'!$B$35/'Dados de Entrada'!$B$20,IF(V$1<'Dados de Entrada'!$B$19+'Dados de Entrada'!$B$18,0,\"\"))","v":355299.74679282482},{"$f":"IF(AND(W$1>='Dados de Entrada'!$B$19+'Dados de Entrada'!$B$18,W$1<='Dados de Entrada'!$B$21),'Dados de Entrada'!$B$35/'Dados de Entrada'!$B$20,IF(W$1<'Dados de Entrada'!$B$19+'Dados de Entrada'!$B$18,0,\"\"))","v":355299.74679282482},{"$f":"IF(AND(X$1>='Dados de Entrada'!$B$19+'Dados de Entrada'!$B$18,X$1<='Dados de Entrada'!$B$21),'Dados de Entrada'!$B$35/'Dados de Entrada'!$B$20,IF(X$1<'Dados de Entrada'!$B$19+'Dados de Entrada'!$B$18,0,\"\"))","v":""},{"$f":"IF(AND(Y$1>='Dados de Entrada'!$B$19+'Dados de Entrada'!$B$18,Y$1<='Dados de Entrada'!$B$21),'Dados de Entrada'!$B$35/'Dados de Entrada'!$B$20,IF(Y$1<'Dados de Entrada'!$B$19+'Dados de Entrada'!$B$18,0,\"\"))","v":""},{"$f":"IF(AND(Z$1>='Dados de Entrada'!$B$19+'Dados de Entrada'!$B$18,Z$1<='Dados de Entrada'!$B$21),'Dados de Entrada'!$B$35/'Dados de Entrada'!$B$20,IF(Z$1<'Dados de Entrada'!$B$19+'Dados de Entrada'!$B$18,0,\"\"))","v":""},{"$f":"IF(AND(AA$1>='Dados de Entrada'!$B$19+'Dados de Entrada'!$B$18,AA$1<='Dados de Entrada'!$B$21),'Dados de Entrada'!$B$35/'Dados de Entrada'!$B$20,IF(AA$1<'Dados de Entrada'!$B$19+'Dados de Entrada'!$B$18,0,\"\"))","v":""},{"$f":"IF(AND(AB$1>='Dados de Entrada'!$B$19+'Dados de Entrada'!$B$18,AB$1<='Dados de Entrada'!$B$21),'Dados de Entrada'!$B$35/'Dados de Entrada'!$B$20,IF(AB$1<'Dados de Entrada'!$B$19+'Dados de Entrada'!$B$18,0,\"\"))","v":""},{"$f":"IF(AND(AC$1>='Dados de Entrada'!$B$19+'Dados de Entrada'!$B$18,AC$1<='Dados de Entrada'!$B$21),'Dados de Entrada'!$B$35/'Dados de Entrada'!$B$20,IF(AC$1<'Dados de Entrada'!$B$19+'Dados de Entrada'!$B$18,0,\"\"))","v":""},{"$f":"IF(AND(AD$1>='Dados de Entrada'!$B$19+'Dados de Entrada'!$B$18,AD$1<='Dados de Entrada'!$B$21),'Dados de Entrada'!$B$35/'Dados de Entrada'!$B$20,IF(AD$1<'Dados de Entrada'!$B$19+'Dados de Entrada'!$B$18,0,\"\"))","v":""},{"$f":"IF(AND(AE$1>='Dados de Entrada'!$B$19+'Dados de Entrada'!$B$18,AE$1<='Dados de Entrada'!$B$21),'Dados de Entrada'!$B$35/'Dados de Entrada'!$B$20,IF(AE$1<'Dados de Entrada'!$B$19+'Dados de Entrada'!$B$18,0,\"\"))","v":""},{"$f":"IF(AND(AF$1>='Dados de Entrada'!$B$19+'Dados de Entrada'!$B$18,AF$1<='Dados de Entrada'!$B$21),'Dados de Entrada'!$B$35/'Dados de Entrada'!$B$20,IF(AF$1<'Dados de Entrada'!$B$19+'Dados de Entrada'!$B$18,0,\"\"))","v":""},{"$f":"IF(AND(AG$1>='Dados de Entrada'!$B$19+'Dados de Entrada'!$B$18,AG$1<='Dados de Entrada'!$B$21),'Dados de Entrada'!$B$35/'Dados de Entrada'!$B$20,IF(AG$1<'Dados de Entrada'!$B$19+'Dados de Entrada'!$B$18,0,\"\"))","v":""},{"$f":"IF(AND(AH$1>='Dados de Entrada'!$B$19+'Dados de Entrada'!$B$18,AH$1<='Dados de Entrada'!$B$21),'Dados de Entrada'!$B$35/'Dados de Entrada'!$B$20,IF(AH$1<'Dados de Entrada'!$B$19+'Dados de Entrada'!$B$18,0,\"\"))","v":""},{"$f":"IF(AND(AI$1>='Dados de Entrada'!$B$19+'Dados de Entrada'!$B$18,AI$1<='Dados de Entrada'!$B$21),'Dados de Entrada'!$B$35/'Dados de Entrada'!$B$20,IF(AI$1<'Dados de Entrada'!$B$19+'Dados de Entrada'!$B$18,0,\"\"))","v":""},{"$f":"IF(AND(AJ$1>='Dados de Entrada'!$B$19+'Dados de Entrada'!$B$18,AJ$1<='Dados de Entrada'!$B$21),'Dados de Entrada'!$B$35/'Dados de Entrada'!$B$20,IF(AJ$1<'Dados de Entrada'!$B$19+'Dados de Entrada'!$B$18,0,\"\"))","v":""},{"$f":"IF(AND(AK$1>='Dados de Entrada'!$B$19+'Dados de Entrada'!$B$18,AK$1<='Dados de Entrada'!$B$21),'Dados de Entrada'!$B$35/'Dados de Entrada'!$B$20,IF(AK$1<'Dados de Entrada'!$B$19+'Dados de Entrada'!$B$18,0,\"\"))","v":""},{"$f":"IF(AND(AL$1>='Dados de Entrada'!$B$19+'Dados de Entrada'!$B$18,AL$1<='Dados de Entrada'!$B$21),'Dados de Entrada'!$B$35/'Dados de Entrada'!$B$20,IF(AL$1<'Dados de Entrada'!$B$19+'Dados de Entrada'!$B$18,0,\"\"))","v":""},{"$f":"IF(AND(AM$1>='Dados de Entrada'!$B$19+'Dados de Entrada'!$B$18,AM$1<='Dados de Entrada'!$B$21),'Dados de Entrada'!$B$35/'Dados de Entrada'!$B$20,IF(AM$1<'Dados de Entrada'!$B$19+'Dados de Entrada'!$B$18,0,\"\"))","v":""},{"$f":"IF(AND(AN$1>='Dados de Entrada'!$B$19+'Dados de Entrada'!$B$18,AN$1<='Dados de Entrada'!$B$21),'Dados de Entrada'!$B$35/'Dados de Entrada'!$B$20,IF(AN$1<'Dados de Entrada'!$B$19+'Dados de Entrada'!$B$18,0,\"\"))","v":""},{"$f":"IF(AND(AO$1>='Dados de Entrada'!$B$19+'Dados de Entrada'!$B$18,AO$1<='Dados de Entrada'!$B$21),'Dados de Entrada'!$B$35/'Dados de Entrada'!$B$20,IF(AO$1<'Dados de Entrada'!$B$19+'Dados de Entrada'!$B$18,0,\"\"))","v":""}]
["Depreciação do Capex do CCS (4.2)",{"$f":"IF(AND(B$1>='Dados de Entrada'!$B$19+'Dados de Entrada'!$B$18,B$1<='Dados de Entrada'!$B$21),('Dados de Entrada'!$B$62+'Dados de Entrada'!$B$85)/'Dados de Entrada'!$B$20,IF(B$1<'Dados de Entrada'!$B$19+'Dados de Entrada'!$B$18,0,\"\"))","v":0},{"$f":"IF(AND(C$1>='Dados de Entrada'!$B$19+'Dados de Entrada'!$B$18,C$1<='Dados de Entrada'!$B$21),('Dados de Entrada'!$B$62+'Dados de Entrada'!$B$85)/'Dados de Entrada'!$B$20,IF(C$1<'Dados de Entrada'!$B$19+'Dados de Entrada'!$B$18,0,\"\"))","v":0},{"$f":"IF(AND(D$1>='Dados de Entrada'!$B$19+'Dados de Entrada'!$B$18,D$1<='Dados de Entrada'!$B$21),('Dados de Entrada'!$B$62+'Dados de Entrada'!$B$85)/'Dados de Entrada'!$B$20,IF(D$1<'Dados de Entrada'!$B$19+'Dados de Entrada'!$B$18,0,\"\"))","v":0},{"$f":"IF(AND(E$1>='Dados de Entrada'!$B$19+'Dados de Entrada'!$B$18,E$1<='Dados de Entrada'!$B$21),('Dados de Entrada'!$B$62+'Dados de Entrada'!$B$85)/'Dados de Entrada'!$B$20,IF(E$1<'Dados de Entrada'!$B$19+'Dados de Entrada'!$B$18,0,\"\"))","v":0},{"$f":"IF(AND(F$1>='Dados de Entrada'!$B$19+'Dados de Entrada'!$B$18,F$1<='Dados de Entrada'!$B$21),('Dados de Entrada'!$B$62+'Dados de Entrada'!$B$85)/'Dados de Entrada'!$B$20,IF(F$1<'Dados de Entrada'!$B$19+'Dados de Entrada'!$B$18,0,\"\"))","v":0},{"$f":"IF(AND(G$1>='Dados de Entrada'!$B$19+'Dados de Entrada'!$B$18,G$1<='Dados de Entrada'!$B$21),('Dados de Entrada'!$B$62+'Dados de Entrada'!$B$85)/'Dados de Entrada'!$B$20,IF(G$1<'Dados de Entrada'!$B$19+'Dados de Entrada'!$B$18,0,\"\"))","v":0},{"$f":"IF(AND(H$1>='Dados de Entrada'!$B$19+'Dados de Entrada'!$B$18,H$1<='Dados de Entrada'!$B$21),('Dados de Entrada'!$B$62+'Dados de Entrada'!$B$85)/'Dados de Entrada'!$B$20,IF(H$1<'Dados de Entrada'!$B$19+'Dados de Entrada'!$B$18,0,\"\"))","v":0},{"$f":"IF(AND(I$1>='Dados de Entrada'!$B$19+'Dados de Entrada'!$B$18,I$1<='Dados de Entrada'!$B$21),('Dados de Entrada'!$B$62+'Dados de Entrada'!$B$85)/'Dados de Entrada'!$B$20,IF(I$1<'Dados de Entrada'!$B$19+'Dados de Entrada'!$B$18,0,\"\"))","v":0},{"$f":"IF(AND(J$1>='Dados de Entrada'!$B$19+'Dados de Entrada'!$B$18,J$1<='Dados de Entrada'!$B$21),('Dados de Entrada'!$B$62+'Dados de Entrada'!$B$85)/'Dados de Entrada'!$B$20,IF(J$1<'Dados de Entrada'!$B$19+'Dados de Entrada'!$B$18,0,\"\"))","v":0},{"$f":"IF(AND(K$1>='Dados de Entrada'!$B$19+'Dados de Entrada'!$B$18,K$1<='Dados de Entrada'!$B$21),('Dados de Entrada'!$B$62+'Dados de Entrada'!$B$85)/'Dados de Entrada'!$B$20,IF(K$1<'Dados de Entrada'!$B$19+'Dados de Entrada'!$B$18,0,\"\"))","v":0},{"$f":"IF(AND(L$1>='Dados de Entrada'!$B$19+'Dados de Entrada'!$B$18,L$1<='Dados de Entrada'!$B$21),('Dados de Entrada'!$B$62+'Dados de Entrada'!$B$85)/'Dados de Entrada'!$B$20,IF(L$1<'Dados de Entrada'!$B$19+'Dados de Entrada'!$B$18,0,\"\"))","v":0},{"$f":"IF(AND(M$1>='Dados de Entrada'!$B$19+'Dados de Entrada'!$B$18,M$1<='Dados de Entrada'!$B$21),('Dados de Entrada'!$B$62+'Dados de Entrada'!$B$85)/'Dados de Entrada'!$B$20,IF(M$1<'Dados de Entrada'!$B$19+'Dados de Entrada'!$B$18,0,\"\"))","v":0},{"$f":"IF(AND(N$1>='Dados de Entrada'!$B$19+'Dados de Entrada'!$B$18,N$1<='Dados de Entrada'!$B$21),('Dados de Entrada'!$B$62+'Dados de Entrada'!$B$85)/'Dados de Entrada'!$B$20,IF(N$1<'Dados de Entrada'!$B$19+'Dados de Entrada'!$B$18,0,\"\"))","v":0},{"$f":"IF(AND(O$1>='Dados de Entrada'!$B$19+'Dados de Entrada'!$B$18,O$1<='Dados de Entrada'!$B$21),('Dados de Entrada'!$B$62+'Dados de Entrada'!$B$85)/'Dados de Entrada'!$B$20,IF(O$1<'Dados de Entrada'!$B$19+'Dados de Entrada'!$B$18,0,\"\"))","v":0},{"$f":"IF(AND(P$1>='Dados de Entrada'!$B$19+'Dados de Entrada'!$B$18,P$1<='Dados de Entrada'!$B$21),('Dados de Entrada'!$B$62+'Dados de Entrada'!$B$85)/'Dados de Entrada'!$B$20,IF(P$1<'Dados de Entrada'!$B$19+'Dados de Entrada'!$B$18,0,\"\"))","v":0},{"$f":"IF(AND(Q$1>='Dados de Entrada'!$B$19+'Dados de Entrada'!$B$18,Q$1<='Dados de Entrada'!$B$21),('Dados de Entrada'!$B$62+'Dados de Entrada'!$B$85)/'Dados de Entrada'!$B$20,IF(Q$1<'Dados de Entrada'!$B$19+'Dados de Entrada'!$B$18,0,\"\"))","v":0},{"$f":"IF(AND(R$1>='Dados de Entrada'!$B$19+'Dados de Entrada'!$B$18,R$1<='Dados de Entrada'!$B$21),('Dados de Entrada'!$B$62+'Dados de Entrada'!$B$85)/'Dados de Entrada'!$B$20,IF(R$1<'Dados de Entrada'!$B$19+'Dados de Entrada'!$B$18,0,\"\"))","v":0},{"$f":"IF(AND(S$1>='Dados de Entrada'!$B$19+'Dados de Entrada'!$B$18,S$1<='Dados de Entrada'!$B$21),('Dados de Entrada'!$B$62+'Dados de Entrada'!$B$85)/'Dados de Entrada'!$B$20,IF(S$1<'Dados de Entrada'!$B$19+'Dados de Entrada'!$B$18,0,\"\"))","v":0},{"$f":"IF(AND(T$1>='Dados de Entrada'!$B$19+'Dados de Entrada'!$B$18,T$1<='Dados de Entrada'!$B$21),('Dados de Entrada'!$B$62+'Dados de Entrada'!$B$85)/'Dados de Entrada'!$B$20,IF(T$1<'Dados de Entrada'!$B$19+'Dados de Entrada'!$B$18,0,\"\"))","v":0},{"$f":"IF(AND(U$1>='Dados de Entrada'!$B$19+'Dados de Entrada'!$B$18,U$1<='Dados de Entrada'!$B$21),('Dados de Entrada'!$B$62+'Dados de Entrada'!$B$85)/'Dados de Entrada'!$B$20,IF(U$1<'Dados de Entrada'!$B$19+'Dados de Entrada'!$B$18,0,\"\"))","v":0},{"$f":"IF(AND(V$1>='Dados de Entrada'!$B$19+'Dados de Entrada'!$B$18,V$1<='Dados de Entrada'!$B$21),('Dados de Entrada'!$B$62+'Dados de Entrada'!$B$85)/'Dados de Entrada'!$B$20,IF(V$1<'Dados de Entrada'!$B$19+'Dados de Entrada'!$B$18,0,\"\"))","v":0},{"$f":"IF(AND(W$1>='Dados de Entrada'!$B$19+'Dados de Entrada'!$B$18,W$1<='Dados de Entrada'!$B$21),('Dados de Entrada'!$B$62+'Dados de Entrada'!$B$85)/'Dados de Entrada'!$B$20,IF(W$1<'Dados de Entrada'!$B$19+'Dados de Entrada'!$B$18,0,\"\"))","v":0},{"$f":"IF(AND(X$1>='Dados de Entrada'!$B$19+'Dados de Entrada'!$B$18,X$1<='Dados de Entrada'!$B$21),('Dados de Entrada'!$B$62+'Dados de Entrada'!$B$85)/'Dados de Entrada'!$B$20,IF(X$1<'Dados de Entrada'!$B$19+'Dados de Entrada'!$B$18,0,\"\"))","v":""},{"$f":"IF(AND(Y$1>='Dados de Entrada'!$B$19+'Dados de Entrada'!$B$18,Y$1<='Dados de Entrada'!$B$21),('Dados de Entrada'!$B$62+'Dados de Entrada'!$B$85)/'Dados de Entrada'!$B$20,IF(Y$1<'Dados de Entrada'!$B$19+'Dados de Entrada'!$B$18,0,\"\"))","v":""},{"$f":"IF(AND(Z$1>='Dados de Entrada'!$B$19+'Dados de Entrada'!$B$18,Z$1<='Dados de Entrada'!$B$21),('Dados de Entrada'!$B$62+'Dados de Entrada'!$B$85)/'Dados de Entrada'!$B$20,IF(Z$1<'Dados de Entrada'!$B$19+'Dados de Entrada'!$B$18,0,\"\"))","v":""},{"$f":"IF(AND(AA$1>='Dados de Entrada'!$B$19+'Dados de Entrada'!$B$18,AA$1<='Dados de Entrada'!$B$21),('Dados de Entrada'!$B$62+'Dados de Entrada'!$B$85)/'Dados de Entrada'!$B$20,IF(AA$1<'Dados de Entrada'!$B$19+'Dados de Entrada'!$B$18,0,\"\"))","v":""},{"$f":"IF(AND(AB$1>='Dados de Entrada'!$B$19+'Dados de Entrada'!$B$18,AB$1<='Dados de Entrada'!$B$21),('Dados de Entrada'!$B$62+'Dados de Entrada'!$B$85)/'Dados de Entrada'!$B$20,IF(AB$1<'Dados de Entrada'!$B$19+'Dados de Entrada'!$B$18,0,\"\"))","v":""},{"$f":"IF(AND(AC$1>='Dados de Entrada'!$B$19+'Dados de Entrada'!$B$18,AC$1<='Dados de Entrada'!$B$21),('Dados de Entrada'!$B$62+'Dados de Entrada'!$B$85)/'Dados de Entrada'!$B$20,IF(AC$1<'Dados de Entrada'!$B$19+'Dados de Entrada'!$B$18,0,\"\"))","v":""},{"$f":"IF(AND(AD$1>='Dados de Entrada'!$B$19+'Dados de Entrada'!$B$18,AD$1<='Dados de Entrada'!$B$21),('Dados de Entrada'!$B$62+'Dados de Entrada'!$B$85)/'Dados de Entrada'!$B$20,IF(AD$1<'Dados de Entrada'!$B$19+'Dados de Entrada'!$B$18,0,\"\"))","v":""},{"$f":"IF(AND(AE$1>='Dados de Entrada'!$B$19+'Dados de Entrada'!$B$18,AE$1<='Dados de Entrada'!$B$21),('Dados de Entrada'!$B$62+'Dados de Entrada'!$B$85)/'Dados de Entrada'!$B$20,IF(AE$1<'Dados de Entrada'!$B$19+'Dados de Entrada'!$B$18,0,\"\"))","v":""},{"$f":"IF(AND(AF$1>='Dados de Entrada'!$B$19+'Dados de Entrada'!$B$18,AF$1<='Dados de Entrada'!$B$21),('Dados de Entrada'!$B$62+'Dados de Entrada'!$B$85)/'Dados de Entrada'!$B$20,IF(AF$1<'Dados de Entrada'!$B$19+'Dados de Entrada'!$B$18,0,\"\"))","v":""},{"$f":"IF(AND(AG$1>='Dados de Entrada'!$B$19+'Dados de Entrada'!$B$18,AG$1<='Dados de Entrada'!$B$21),('Dados de Entrada'!$B$62+'Dados de Entrada'!$B$85)/'Dados de Entrada'!$B$20,IF(AG$1<'Dados de Entrada'!$B$19+'Dados de Entrada'!$B$18,0,\"\"))","v":""},{"$f":"IF(AND(AH$1>='Dados de Entrada'!$B$19+'Dados de Entrada'!$B$18,AH$1<='Dados de Entrada'!$B$21),('Dados de Entrada'!$B$62+'Dados de Entrada'!$B$85)/'Dados de Entrada'!$B$20,IF(AH$1<'Dados de Entrada'!$B$19+'Dados de Entrada'!$B$18,0,\"\"))","v":""},{"$f":"IF(AND(AI$1>='Dados de Entrada'!$B$19+'Dados de Entrada'!$B$18,AI$1<='Dados de Entrada'!$B$21),('Dados de Entrada'!$B$62+'Dados de Entrada'!$B$85)/'Dados de Entrada'!$B$20,IF(AI$1<'Dados de Entrada'!$B$19+'Dados de Entrada'!$B$18,0,\"\"))","v":""},{"$f":"IF(AND(AJ$1>='Dados de Entrada'!$B$19+'Dados de Entrada'!$B$18,AJ$1<='Dados de Entrada'!$B$21),('Dados de Entrada'!$B$62+'Dados de Entrada'!$B$85)/'Dados de Entrada'!$B$20,IF(AJ$1<'Dados de Entrada'!$B$19+'Dados de Entrada'!$B$18,0,\"\"))","v":""},{"$f":"IF(AND(AK$1>='Dados de Entrada'!$B$19+'Dados de Entrada'!$B$18,AK$1<='Dados de Entrada'!$B$21),('Dados de Entrada'!$B$62+'Dados de Entrada'!$B$85)/'Dados de Entrada'!$B$20,IF(AK$1<'Dados de Entrada'!$B$19+'Dados de Entrada'!$B$18,0,\"\"))","v":""},{"$f":"IF(AND(AL$1>='Dados de Entrada'!$B$19+'Dados de Entrada'!$B$18,AL$1<='Dados de Entrada'!$B$21),('Dados de Entrada'!$B$62+'Dados de Entrada'!$B$85)/'Dados de Entrada'!$B$20,IF(AL$1<'Dados de Entrada'!$B$19+'Dados de Entrada'!$B$18,0,\"\"))","v":""},{"$f":"IF(AND(AM$1>='Dados de Entrada'!$B$19+'Dados de Entrada'!$B$18,AM$1<='Dados de Entrada'!$B$21),('Dados de Entrada'!$B$62+'Dados de Entrada'!$B$85)/'Dados de Entrada'!$B$20,IF(AM$1<'Dados de Entrada'!$B$19+'Dados de Entrada'!$B$18,0,\"\"))","v":""},{"$f":"IF(AND(AN$1>='Dados de Entrada'!$B$19+'Dados de Entrada'!$B$18,AN$1<='Dados de Entrada'!$B$21),('Dados de Entrada'!$B$62+'Dados de Entrada'!$B$85)/'Dados de Entrada'!$B$20,IF(AN$1<'Dados de Entrada'!$B$19+'Dados de Entrada'!$B$18,0,\"\"))","v":""},{"$f":"IF(AND(AO$1>='Dados de Entrada'!$B$19+'Dados de Entrada'!$B$18,AO$1<='Dados de Entrada'!$B$21),('Dados de Entrada'!$B$62+'Dados de Entrada'!$B$85)/'Dados de Entrada'!$B$20,IF(AO$1<'Dados de Entrada'!$B$19+'Dados de Entrada'!$B$18,0,\"\"))","v":""}]
["EBIT (5) = (3) - (4)",{"$f":"IFERROR(B18-B19,\"\")","v":0},{"$f":"IFERROR(C18-C19,\"\")","v":0},502796.58351774618,{"$f":"IFERROR(E18-E19,\"\")","v":502796.58351774618},502796.58351774618,502796.58351774618,502796.58351774618,502796.58351774618,502796.58351774618,502796.58351774618,502796.58351774618,502796.58351774618,502796.58351774618,502796.58351774618,502796.58351774618,502796.58351774618,502796.58351774618,502796.58351774618,502796.58351774618,502796.58351774618,502796.58351774618,502796.58351774618,"","","","","","","","","","","","","","","","","",""]
["Imposto de Renda (CSLL + IRPJ) (6) = (5) * i",{"$f":"IF(AND(B$1>='Dados de Entrada'!$B$19+'Dados de Entrada'!$B$18,B$1<='Dados de Entrada'!$B$21),IF(B22>0,B22*SUM('Dados de Entrada'!$B$23:$B$24),0),IF(B$1<'Dados de Entrada'!$B$19+'Dados de Entrada'!$B$18,0,\"\"))","v":0},{"$f":"IF(AND(C$1>='Dados de Entrada'!$B$19+'Dados de Entrada'!$B$18,C$1<='Dados de Entrada'!$B$21),IF(C22>0,C22*SUM('Dados de Entrada'!$B$23:$B$24),0),IF(C$1<'Dados de Entrada'!$B$19+'Dados de Entrada'!$B$18,0,\"\"))","v":0},{"$f":"IF(AND(D$1>='Dados de Entrada'!$B$19+'Dados de Entrada'!$B$18,D$1<='Dados de Entrada'!$B$21),IF(D22>0,D22*SUM('Dados de Entrada'!$B$23:$B$24),0),IF(D$1<'Dados de Entrada'!$B$19+'Dados de Entrada'!$B$18,0,\"\"))","v":0},{"$f":"IF(AND(E$1>='Dados de Entrada'!$B$19+'Dados de Entrada'!$B$18,E$1<='Dados de Entrada'!$B$21),IF(E22>0,E22*SUM('Dados de Entrada'!$B$23:$B$24),0),IF(E$1<'Dados de Entrada'!$B$19+'Dados de Entrada'!$B$18,0,\"\"))","v":0},{"$f":"IF(AND(F$1>='Dados de Entrada'!$B$19+'Dados de Entrada'!$B$18,F$1<='Dados de Entrada'!$B$21),IF(F22>0,F22*SUM('Dados de Entrada'!$B$23:$B$24),0),IF(F$1<'Dados de Entrada'!$B$19+'Dados de Entrada'!$B$18,0,\"\"))","v":0},{"$f":"IF(AND(G$1>='Dados de Entrada'!$B$19+'Dados de Entrada'!$B$18,G$1<='Dados de Entrada'!$B$21),IF(G22>0,G22*SUM('Dados de Entrada'!$B$23:$B$24),0),IF(G$1<'Dados de Entrada'!$B$19+'Dados de Entrada'!$B$18,0,\"\"))","v":0},{"$f":"IF(AND(H$1>='Dados de Entrada'!$B$19+'Dados de Entrada'!$B$18,H$1<='Dados de Entrada'!$B$21),IF(H22>0,H22*SUM('Dados de Entrada'!$B$23:$B$24),0),IF(H$1<'Dados de Entrada'!$B$19+'Dados de Entrada'!$B$18,0,\"\"))","v":0},{"$f":"IF(AND(I$1>='Dados de Entrada'!$B$19+'Dados de Entrada'!$B$18,I$1<='Dados de Entrada'!$B$21),IF(I22>0,I22*SUM('Dados de Entrada'!$B$23:$B$24),0),IF(I$1<'Dados de Entrada'!$B$19+'Dados de Entrada'!$B$18,0,\"\"))","v":0},{"$f":"IF(AND(J$1>='Dados de Entrada'!$B$19+'Dados de Entrada'!$B$18,J$1<='Dados de Entrada'!$B$21),IF(J22>0,J22*SUM('Dados de Entrada'!$B$23:$B$24),0),IF(J$1<'Dados de Entrada'!$B$19+'Dados de Entrada'!$B$18,0,\"\"))","v":0},{"$f":"IF(AND(K$1>='Dados de Entrada'!$B$19+'Dados de Entrada'!$B$18,K$1<='Dados de Entrada'!$B$21),IF(K22>0,K22*SUM('Dados de Entrada'!$B$23:$B$24),0),IF(K$1<'Dados de Entrada'!$B$19+'Dados de Entrada'!$B$18,0,\"\"))","v":0},{"$f":"IF(AND(L$1>='Dados de Entrada'!$B$19+'Dados de Entrada'!$B$18,L$1<='Dados de Entrada'!$B$21),IF(L22>0,L22*SUM('Dados de Entrada'!$B$23:$B$24),0),IF(L$1<'Dados de Entrada'!$B$19+'Dados de Entrada'!$B$18,0,\"\"))","v":0},{"$f":"IF(AND(M$1>='Dados de Entrada'!$B$19+'Dados de Entrada'!$B$18,M$1<='Dados de Entrada'!$B$21),IF(M22>0,M22*SUM('Dados de Entrada'!$B$23:$B$24),0),IF(M$1<'Dados de Entrada'!$B$19+'Dados de Entrada'!$B$18,0,\"\"))","v":0},{"$f":"IF(AND(N$1>='Dados de Entrada'!$B$19+'Dados de Entrada'!$B$18,N$1<='Dados de Entrada'!$B$21),IF(N22>0,N22*SUM('Dados de Entrada'!$B$23:$B$24),0),IF(N$1<'Dados de Entrada'!$B$19+'Dados de Entrada'!$B$18,0,\"\"))","v":0},{"$f":"IF(AND(O$1>='Dados de Entrada'!$B$19+'Dados de Entrada'!$B$18,O$1<='Dados de Entrada'!$B$21),IF(O22>0,O22*SUM('Dados de Entrada'!$B$23:$B$24),0),IF(O$1<'Dados de Entrada'!$B$19+'Dados de Entrada'!$B$18,0,\"\"))","v":0},{"$f":"IF(AND(P$1>='Dados de Entrada'!$B$19+'Dados de Entrada'!$B$18,P$1<='Dados de Entrada'!$B$21),IF(P22>0,P22*SUM('Dados de Entrada'!$B$23:$B$24),0),IF(P$1<'Dados de Entrada'!$B$19+'Dados de Entrada'!$B$18,0,\"\"))","v":0},{"$f":"IF(AND(Q$1>='Dados de Entrada'!$B$19+'Dados de Entrada'!$B$18,Q$1<='Dados de Entrada'!$B$21),IF(Q22>0,Q22*SUM('Dados de Entrada'!$B$23:$B$24),0),IF(Q$1<'Dados de Entrada'!$B$19+'Dados de Entrada'!$B$18,0,\"\"))","v":0},{"$f":"IF(AND(R$1>='Dados de Entrada'!$B$19+'Dados de Entrada'!$B$18,R$1<='Dados de Entrada'!$B$21),IF(R22>0,R22*SUM('Dados de Entrada'!$B$23:$B$24),0),IF(R$1<'Dados de Entrada'!$B$19+'Dados de Entrada'!$B$18,0,\"\"))","v":0},{"$f":"IF(AND(S$1>='Dados de Entrada'!$B$19+'Dados de Entrada'!$B$18,S$1<='Dados de Entrada'!$B$21),IF(S22>0,S22*SUM('Dados de Entrada'!$B$23:$B$24),0),IF(S$1<'Dados de Entrada'!$B$19+'Dados de Entrada'!$B$18,0,\"\"))","v":0},{"$f":"IF(AND(T$1>='Dados de Entrada'!$B$19+'Dados de Entrada'!$B$18,T$1<='Dados de Entrada'!$B$21),IF(T22>0,T22*SUM('Dados de Entrada'!$B$23:$B$24),0),IF(T$1<'Dados de Entrada'!$B$19+'Dados de Entrada'!$B$18,0,\"\"))","v":0},{"$f":"IF(AND(U$1>='Dados de Entrada'!$B$19+'Dados de Entrada'!$B$18,U$1<='Dados de Entrada'!$B$21),IF(U22>0,U22*SUM('Dados de Entrada'!$B$23:$B$24),0),IF(U$1<'Dados de Entrada'!$B$19+'Dados de Entrada'!$B$18,0,\"\"))","v":0},{"$f":"IF(AND(V$1>='Dados de Entrada'!$B$19+'Dados de Entrada'!$B$18,V$1<='Dados de Entrada'!$B$21),IF(V22>0,V22*SUM('Dados de Entrada'!$B$23:$B$24),0),IF(V$1<'Dados de Entrada'!$B$19+'Dados de Entrada'!$B$18,0,\"\"))","v":0},{"$f":"IF(AND(W$1>='Dados de Entrada'!$B$19+'Dados de Entrada'!$B$18,W$1<='Dados de Entrada'!$B$21),IF(W22>0,W22*SUM('Dados de Entrada'!$B$23:$B$24),0),IF(W$1<'Dados de Entrada'!$B$19+'Dados de Entrada'!$B$18,0,\"\"))","v":0},{"$f":"IF(AND(X$1>='Dados de Entrada'!$B$19+'Dados de Entrada'!$B$18,X$1<='Dados de Entrada'!$B$21),IF(X22>0,X22*SUM('Dados de Entrada'!$B$23:$B$24),0),IF(X$1<'Dados de Entrada'!$B$19+'Dados de Entrada'!$B$18,0,\"\"))","v":""},{"$f":"IF(AND(Y$1>='Dados de Entrada'!$B$19+'Dados de Entrada'!$B$18,Y$1<='Dados de Entrada'!$B$21),IF(Y22>0,Y22*SUM('Dados de Entrada'!$B$23:$B$24),0),IF(Y$1<'Dados de Entrada'!$B$19+'Dados de Entrada'!$B$18,0,\"\"))","v":""},{"$f":"IF(AND(Z$1>='Dados de Entrada'!$B$19+'Dados de Entrada'!$B$18,Z$1<='Dados de Entrada'!$B$21),IF(Z22>0,Z22*SUM('Dados de Entrada'!$B$23:$B$24),0),IF(Z$1<'Dados de Entrada'!$B$19+'Dados de Entrada'!$B$18,0,\"\"))","v":""},{"$f":"IF(AND(AA$1>='Dados de Entrada'!$B$19+'Dados de Entrada'!$B$18,AA$1<='Dados de Entrada'!$B$21),IF(AA22>0,AA22*SUM('Dados de Entrada'!$B$23:$B$24),0),IF(AA$1<'Dados de Entrada'!$B$19+'Dados de Entrada'!$B$18,0,\"\"))","v":""},{"$f":"IF(AND(AB$1>='Dados de Entrada'!$B$19+'Dados de Entrada'!$B$18,AB$1<='Dados de Entrada'!$B$21),IF(AB22>0,AB22*SUM('Dados de Entrada'!$B$23:$B$24),0),IF(AB$1<'Dados de Entrada'!$B$19+'Dados de Entrada'!$B$18,0,\"\"))","v":""},{"$f":"IF(AND(AC$1>='Dados de Entrada'!$B$19+'Dados de Entrada'!$B$18,AC$1<='Dados de Entrada'!$B$21),IF(AC22>0,AC22*SUM('Dados de Entrada'!$B$23:$B$24),0),IF(AC$1<'Dados de Entrada'!$B$19+'Dados de Entrada'!$B$18,0,\"\"))","v":""},{"$f":"IF(AND(AD$1>='Dados de Entrada'!$B$19+'Dados de Entrada'!$B$18,AD$1<='Dados de Entrada'!$B$21),IF(AD22>0,AD22*SUM('Dados de Entrada'!$B$23:$B$24),0),IF(AD$1<'Dados de Entrada'!$B$19+'Dados de Entrada'!$B$18,0,\"\"))","v":""},{"$f":"IF(AND(AE$1>='Dados de Entrada'!$B$19+'Dados de Entrada'!$B$18,AE$1<='Dados de Entrada'!$B$21),IF(AE22>0,AE22*SUM('Dados de Entrada'!$B$23:$B$24),0),IF(AE$1<'Dados de Entrada'!$B$19+'Dados de Entrada'!$B$18,0,\"\"))","v":""},{"$f":"IF(AND(AF$1>='Dados de Entrada'!$B$19+'Dados de Entrada'!$B$18,AF$1<='Dados de Entrada'!$B$21),IF(AF22>0,AF22*SUM('Dados de Entrada'!$B$23:$B$24),0),IF(AF$1<'Dados de Entrada'!$B$19+'Dados de Entrada'!$B$18,0,\"\"))","v":""},{"$f":"IF(AND(AG$1>='Dados de Entrada'!$B$19+'Dados de Entrada'!$B$18,AG$1<='Dados de Entrada'!$B$21),IF(AG22>0,AG22*SUM('Dados de Entrada'!$B$23:$B$24),0),IF(AG$1<'Dados de Entrada'!$B$19+'Dados de Entrada'!$B$18,0,\"\"))","v":""},{"$f":"IF(AND(AH$1>='Dados de Entrada'!$B$19+'Dados de Entrada'!$B$18,AH$1<='Dados de Entrada'!$B$21),IF(AH22>0,AH22*SUM('Dados de Entrada'!$B$23:$B$24),0),IF(AH$1<'Dados de Entrada'!$B$19+'Dados de Entrada'!$B$18,0,\"\"))","v":""},{"$f":"IF(AND(AI$1>='Dados de Entrada'!$B$19+'Dados de Entrada'!$B$18,AI$1<='Dados de Entrada'!$B$21),IF(AI22>0,AI22*SUM('Dados de Entrada'!$B$23:$B$24),0),IF(AI$1<'Dados de Entrada'!$B$19+'Dados de Entrada'!$B$18,0,\"\"))","v":""},{"$f":"IF(AND(AJ$1>='Dados de Entrada'!$B$19+'Dados de Entrada'!$B$18,AJ$1<='Dados de Entrada'!$B$21),IF(AJ22>0,AJ22*SUM('Dados de Entrada'!$B$23:$B$24),0),IF(AJ$1<'Dados de Entrada'!$B$19+'Dados de Entrada'!$B$18,0,\"\"))","v":""},{"$f":"IF(AND(AK$1>='Dados de Entrada'!$B$19+'Dados de Entrada'!$B$18,AK$1<='Dados de Entrada'!$B$21),IF(AK22>0,AK22*SUM('Dados de Entrada'!$B$23:$B$24),0),IF(AK$1<'Dados de Entrada'!$B$19+'Dados de Entrada'!$B$18,0,\"\"))","v":""},{"$f":"IF(AND(AL$1>='Dados de Entrada'!$B$19+'Dados de Entrada'!$B$18,AL$1<='Dados de Entrada'!$B$21),IF(AL22>0,AL22*SUM('Dados de Entrada'!$B$23:$B$24),0),IF(AL$1<'Dados de Entrada'!$B$19+'Dados de Entrada'!$B$18,0,\"\"))","v":""},{"$f":"IF(AND(AM$1>='Dados de Entrada'!$B$19+'Dados de Entrada'!$B$18,AM$1<='Dados de Entrada'!$B$21),IF(AM22>0,AM22*SUM('Dados de Entrada'!$B$23:$B$24),0),IF(AM$1<'Dados de Entrada'!$B$19+'Dados de Entrada'!$B$18,0,\"\"))","v":""},{"$f":"IF(AND(AN$1>='Dados de Entrada'!$B$19+'Dados de Entrada'!$B$18,AN$1<='Dados de Entrada'!$B$21),IF(AN22>0,AN22*SUM('Dados de Entrada'!$B$23:$B$24),0),IF(AN$1<'Dados de Entrada'!$B$19+'Dados de Entrada'!$B$18,0,\"\"))","v":""},{"$f":"IF(AND(AO$1>='Dados de Entrada'!$B$19+'Dados de Entrada'!$B$18,AO$1<='Dados de Entrada'!$B$21),IF(AO22>0,AO22*SUM('Dados de Entrada'!$B$23:$B$24),0),IF(AO$1<'Dados de Entrada'!$B$19+'Dados de Entrada'!$B$18,0,\"\"))","v":""}]
["Receita líquida (7) = (5) - (6)",{"$f":"IFERROR(B22-B23,\"\")","v":0},{"$f":"IFERROR(C22-C23,\"\")","v":0},502796.58351774618,502796.58351774618,502796.58351774618,502796.58351774618,502796.58351774618,502796.58351774618,502796.58351774618,502796.58351774618,502796.58351774618,502796.58351774618,502796.58351774618,502796.58351774618,502796.58351774618,502796.58351774618,502796.58351774618,502796.58351774618,502796.58351774618,502796.58351774618,502796.58351774618,502796.58351774618,"","","","","","","","","","","","","","","","","",""]
["Receitas com a venda de créditos de Carbono (8) = (8.1) + (8.2)",{"$f":"IF(AND(B$1>='Dados de Entrada'!$B$19+'Dados de Entrada'!$B$18,B$1<='Dados de Entrada'!$B$21),'Dados de Entrada'!$B$51,IF(B$1<'Dados de Entrada'!$B$19+'Dados de Entrada'!$B$18,0,\"\"))","v":0},{"$f":"IF(AND(C$1>='Dados de Entrada'!$B$19+'Dados de Entrada'!$B$18,C$1<='Dados de Entrada'!$B$21),'Dados de Entrada'!$B$51,IF(C$1<'Dados de Entrada'!$B$19+'Dados de Entrada'!$B$18,0,\"\"))","v":0},{"$f":"IF(AND(D$1>='Dados de Entrada'!$B$19+'Dados de Entrada'!$B$18,D$1<='Dados de Entrada'!$B$21),'Dados de Entrada'!$B$51,IF(D$1<'Dados de Entrada'!$B$19+'Dados de Entrada'!$B$18,0,\"\"))","v":21534.756977424589},{"$f":"IF(AND(E$1>='Dados de Entrada'!$B$19+'Dados de Entrada'!$B$18,E$1<='Dados de Entrada'!$B$21),'Dados de Entrada'!$B$51,IF(E$1<'Dados de Entrada'!$B$19+'Dados de Entrada'!$B$18,0,\"\"))","v":21534.756977424589},{"$f":"IF(AND(F$1>='Dados de Entrada'!$B$19+'Dados de Entrada'!$B$18,F$1<='Dados de Entrada'!$B$21),'Dados de Entrada'!$B$51,IF(F$1<'Dados de Entrada'!$B$19+'Dados de Entrada'!$B$18,0,\"\"))","v":21534.756977424589},{"$f":"IF(AND(G$1>='Dados de Entrada'!$B$19+'Dados de Entrada'!$B$18,G$1<='Dados de Entrada'!$B$21),'Dados de Entrada'!$B$51,IF(G$1<'Dados de Entrada'!$B$19+'Dados de Entrada'!$B$18,0,\"\"))","v":21534.756977424589},{"$f":"IF(AND(H$1>='Dados de Entrada'!$B$19+'Dados de Entrada'!$B$18,H$1<='Dados de Entrada'!$B$21),'Dados de Entrada'!$B$51,IF(H$1<'Dados de Entrada'!$B$19+'Dados de Entrada'!$B$18,0,\"\"))","v":21534.756977424589},{"$f":"IF(AND(I$1>='Dados de Entrada'!$B$19+'Dados de Entrada'!$B$18,I$1<='Dados de Entrada'!$B$21),'Dados de Entrada'!$B$51,IF(I$1<'Dados de Entrada'!$B$19+'Dados de Entrada'!$B$18,0,\"\"))","v":21534.756977424589},{"$f":"IF(AND(J$1>='Dados de Entrada'!$B$19+'Dados de Entrada'!$B$18,J$1<='Dados de Entrada'!$B$21),'Dados de Entrada'!$B$51,IF(J$1<'Dados de Entrada'!$B$19+'Dados de Entrada'!$B$18,0,\"\"))","v":21534.756977424589},{"$f":"IF(AND(K$1>='Dados de Entrada'!$B$19+'Dados de Entrada'!$B$18,K$1<='Dados de Entrada'!$B$21),'Dados de Entrada'!$B$51,IF(K$1<'Dados de Entrada'!$B$19+'Dados de Entrada'!$B$18,0,\"\"))","v":21534.756977424589},{"$f":"IF(AND(L$1>='Dados de Entrada'!$B$19+'Dados de Entrada'!$B$18,L$1<='Dados de Entrada'!$B$21),'Dados de Entrada'!$B$51,IF(L$1<'Dados de Entrada'!$B$19+'Dados de Entrada'!$B$18,0,\"\"))","v":21534.756977424589},{"$f":"IF(AND(M$1>='Dados de Entrada'!$B$19+'Dados de Entrada'!$B$18,M$1<='Dados de Entrada'!$B$21),'Dados de Entrada'!$B$51,IF(M$1<'Dados de Entrada'!$B$19+'Dados de Entrada'!$B$18,0,\"\"))","v":21534.756977424589},{"$f":"IF(AND(N$1>='Dados de Entrada'!$B$19+'Dados de Entrada'!$B$18,N$1<='Dados de Entrada'!$B$21),'Dados de Entrada'!$B$51,IF(N$1<'Dados de Entrada'!$B$19+'Dados de Entrada'!$B$18,0,\"\"))","v":21534.756977424589},{"$f":"IF(AND(O$1>='Dados de Entrada'!$B$19+'Dados de Entrada'!$B$18,O$1<='Dados de Entrada'!$B$21),'Dados de Entrada'!$B$51,IF(O$1<'Dados de Entrada'!$B$19+'Dados de Entrada'!$B$18,0,\"\"))","v":21534.756977424589},{"$f":"IF(AND(P$1>='Dados de Entrada'!$B$19+'Dados de Entrada'!$B$18,P$1<='Dados de Entrada'!$B$21),'Dados de Entrada'!$B$51,IF(P$1<'Dados de Entrada'!$B$19+'Dados de Entrada'!$B$18,0,\"\"))","v":21534.756977424589},{"$f":"IF(AND(Q$1>='Dados de Entrada'!$B$19+'Dados de Entrada'!$B$18,Q$1<='Dados de Entrada'!$B$21),'Dados de Entrada'!$B$51,IF(Q$1<'Dados de Entrada'!$B$19+'Dados de Entrada'!$B$18,0,\"\"))","v":21534.756977424589},{"$f":"IF(AND(R$1>='Dados de Entrada'!$B$19+'Dados de Entrada'!$B$18,R$1<='Dados de Entrada'!$B$21),'Dados de Entrada'!$B$51,IF(R$1<'Dados de Entrada'!$B$19+'Dados de Entrada'!$B$18,0,\"\"))","v":21534.756977424589},{"$f":"IF(AND(S$1>='Dados de Entrada'!$B$19+'Dados de Entrada'!$B$18,S$1<='Dados de Entrada'!$B$21),'Dados de Entrada'!$B$51,IF(S$1<'Dados de Entrada'!$B$19+'Dados de Entrada'!$B$18,0,\"\"))","v":21534.756977424589},{"$f":"IF(AND(T$1>='Dados de Entrada'!$B$19+'Dados de Entrada'!$B$18,T$1<='Dados de Entrada'!$B$21),'Dados de Entrada'!$B$51,IF(T$1<'Dados de Entrada'!$B$19+'Dados de Entrada'!$B$18,0,\"\"))","v":21534.756977424589},{"$f":"IF(AND(U$1>='Dados de Entrada'!$B$19+'Dados de Entrada'!$B$18,U$1<='Dados de Entrada'!$B$21),'Dados de Entrada'!$B$51,IF(U$1<'Dados de Entrada'!$B$19+'Dados de Entrada'!$B$18,0,\"\"))","v":21534.756977424589},{"$f":"IF(AND(V$1>='Dados de Entrada'!$B$19+'Dados de Entrada'!$B$18,V$1<='Dados de Entrada'!$B$21),'Dados de Entrada'!$B$51,IF(V$1<'Dados de Entrada'!$B$19+'Dados de Entrada'!$B$18,0,\"\"))","v":21534.756977424589},{"$f":"IF(AND(W$1>='Dados de Entrada'!$B$19+'Dados de Entrada'!$B$18,W$1<='Dados de Entrada'!$B$21),'Dados de Entrada'!$B$51,IF(W$1<'Dados de Entrada'!$B$19+'Dados de Entrada'!$B$18,0,\"\"))","v":21534.756977424589},{"$f":"IF(AND(X$1>='Dados de Entrada'!$B$19+'Dados de Entrada'!$B$18,X$1<='Dados de Entrada'!$B$21),'Dados de Entrada'!$B$51,IF(X$1<'Dados de Entrada'!$B$19+'Dados de Entrada'!$B$18,0,\"\"))","v":""},{"$f":"IF(AND(Y$1>='Dados de Entrada'!$B$19+'Dados de Entrada'!$B$18,Y$1<='Dados de Entrada'!$B$21),'Dados de Entrada'!$B$51,IF(Y$1<'Dados de Entrada'!$B$19+'Dados de Entrada'!$B$18,0,\"\"))","v":""},{"$f":"IF(AND(Z$1>='Dados de Entrada'!$B$19+'Dados de Entrada'!$B$18,Z$1<='Dados de Entrada'!$B$21),'Dados de Entrada'!$B$51,IF(Z$1<'Dados de Entrada'!$B$19+'Dados de Entrada'!$B$18,0,\"\"))","v":""},{"$f":"IF(AND(AA$1>='Dados de Entrada'!$B$19+'Dados de Entrada'!$B$18,AA$1<='Dados de Entrada'!$B$21),'Dados de Entrada'!$B$51,IF(AA$1<'Dados de Entrada'!$B$19+'Dados de Entrada'!$B$18,0,\"\"))","v":""},{"$f":"IF(AND(AB$1>='Dados de Entrada'!$B$19+'Dados de Entrada'!$B$18,AB$1<='Dados de Entrada'!$B$21),'Dados de Entrada'!$B$51,IF(AB$1<'Dados de Entrada'!$B$19+'Dados de Entrada'!$B$18,0,\"\"))","v":""},{"$f":"IF(AND(AC$1>='Dados de Entrada'!$B$19+'Dados de Entrada'!$B$18,AC$1<='Dados de Entrada'!$B$21),'Dados de Entrada'!$B$51,IF(AC$1<'Dados de Entrada'!$B$19+'Dados de Entrada'!$B$18,0,\"\"))","v":""},{"$f":"IF(AND(AD$1>='Dados de Entrada'!$B$19+'Dados de Entrada'!$B$18,AD$1<='Dados de Entrada'!$B$21),'Dados de Entrada'!$B$51,IF(AD$1<'Dados de Entrada'!$B$19+'Dados de Entrada'!$B$18,0,\"\"))","v":""},{"$f":"IF(AND(AE$1>='Dados de Entrada'!$B$19+'Dados de Entrada'!$B$18,AE$1<='Dados de Entrada'!$B$21),'Dados de Entrada'!$B$51,IF(AE$1<'Dados de Entrada'!$B$19+'Dados de Entrada'!$B$18,0,\"\"))","v":""},{"$f":"IF(AND(AF$1>='Dados de Entrada'!$B$19+'Dados de Entrada'!$B$18,AF$1<='Dados de Entrada'!$B$21),'Dados de Entrada'!$B$51,IF(AF$1<'Dados de Entrada'!$B$19+'Dados de Entrada'!$B$18,0,\"\"))","v":""},{"$f":"IF(AND(AG$1>='Dados de Entrada'!$B$19+'Dados de Entrada'!$B$18,AG$1<='Dados de Entrada'!$B$21),'Dados de Entrada'!$B$51,IF(AG$1<'Dados de Entrada'!$B$19+'Dados de Entrada'!$B$18,0,\"\"))","v":""},{"$f":"IF(AND(AH$1>='Dados de Entrada'!$B$19+'Dados de Entrada'!$B$18,AH$1<='Dados de Entrada'!$B$21),'Dados de Entrada'!$B$51,IF(AH$1<'Dados de Entrada'!$B$19+'Dados de Entrada'!$B$18,0,\"\"))","v":""},{"$f":"IF(AND(AI$1>='Dados de Entrada'!$B$19+'Dados de Entrada'!$B$18,AI$1<='Dados de Entrada'!$B$21),'Dados de Entrada'!$B$51,IF(AI$1<'Dados de Entrada'!$B$19+'Dados de Entrada'!$B$18,0,\"\"))","v":""},{"$f":"IF(AND(AJ$1>='Dados de Entrada'!$B$19+'Dados de Entrada'!$B$18,AJ$1<='Dados de Entrada'!$B$21),'Dados de Entrada'!$B$51,IF(AJ$1<'Dados de Entrada'!$B$19+'Dados de Entrada'!$B$18,0,\"\"))","v":""},{"$f":"IF(AND(AK$1>='Dados de Entrada'!$B$19+'Dados de Entrada'!$B$18,AK$1<='Dados de Entrada'!$B$21),'Dados de Entrada'!$B$51,IF(AK$1<'Dados de Entrada'!$B$19+'Dados de Entrada'!$B$18,0,\"\"))","v":""},{"$f":"IF(AND(AL$1>='Dados de Entrada'!$B$19+'Dados de Entrada'!$B$18,AL$1<='Dados de Entrada'!$B$21),'Dados de Entrada'!$B$51,IF(AL$1<'Dados de Entrada'!$B$19+'Dados de Entrada'!$B$18,0,\"\"))","v":""},{"$f":"IF(AND(AM$1>='Dados de Entrada'!$B$19+'Dados de Entrada'!$B$18,AM$1<='Dados de Entrada'!$B$21),'Dados de Entrada'!$B$51,IF(AM$1<'Dados de Entrada'!$B$19+'Dados de Entrada'!$B$18,0,\"\"))","v":""},{"$f":"IF(AND(AN$1>='Dados de Entrada'!$B$19+'Dados de Entrada'!$B$18,AN$1<='Dados de Entrada'!$B$21),'Dados de Entrada'!$B$51,IF(AN$1<'Dados de Entrada'!$B$19+'Dados de Entrada'!$B$18,0,\"\"))","v":""},{"$f":"IF(AND(AO$1>='Dados de Entrada'!$B$19+'Dados de Entrada'!$B$18,AO$1<='Dados de Entrada'!$B$21),'Dados de Entrada'!$B$51,IF(AO$1<'Dados de Entrada'!$B$19+'Dados de Entrada'!$B$18,0,\"\"))","v":""}]
["Imposto de Renda sobre a receita de créditos de Carbono (9) = (8) * ivc",{"$f":"IF(AND(B$1>='Dados de Entrada'!$B$19+'Dados de Entrada'!$B$18,B$1<='Dados de Entrada'!$B$21),IF(B25>0,B25*'Dados de Entrada'!$B$50,0),IF(B$1<'Dados de Entrada'!$B$19+'Dados de Entrada'!$B$18,0,\"\"))","v":0},{"$f":"IF(AND(C$1>='Dados de Entrada'!$B$19+'Dados de Entrada'!$B$18,C$1<='Dados de Entrada'!$B$21),IF(C25>0,C25*'Dados de Entrada'!$B$50,0),IF(C$1<'Dados de Entrada'!$B$19+'Dados de Entrada'!$B$18,0,\"\"))","v":0},{"$f":"IF(AND(D$1>='Dados de Entrada'!$B$19+'Dados de Entrada'!$B$18,D$1<='Dados de Entrada'!$B$21),IF(D25>0,D25*'Dados de Entrada'!$B$50,0),IF(D$1<'Dados de Entrada'!$B$19+'Dados de Entrada'!$B$18,0,\"\"))","v":3230.2135466136883},{"$f":"IF(AND(E$1>='Dados de Entrada'!$B$19+'Dados de Entrada'!$B$18,E$1<='Dados de Entrada'!$B$21),IF(E25>0,E25*'Dados de Entrada'!$B$50,0),IF(E$1<'Dados de Entrada'!$B$19+'Dados de Entrada'!$B$18,0,\"\"))","v":3230.2135466136883},{"$f":"IF(AND(F$1>='Dados de Entrada'!$B$19+'Dados de Entrada'!$B$18,F$1<='Dados de Entrada'!$B$21),IF(F25>0,F25*'Dados de Entrada'!$B$50,0),IF(F$1<'Dados de Entrada'!$B$19+'Dados de Entrada'!$B$18,0,\"\"))","v":3230.2135466136883},{"$f":"IF(AND(G$1>='Dados de Entrada'!$B$19+'Dados de Entrada'!$B$18,G$1<='Dados de Entrada'!$B$21),IF(G25>0,G25*'Dados de Entrada'!$B$50,0),IF(G$1<'Dados de Entrada'!$B$19+'Dados de Entrada'!$B$18,0,\"\"))","v":3230.2135466136883},{"$f":"IF(AND(H$1>='Dados de Entrada'!$B$19+'Dados de Entrada'!$B$18,H$1<='Dados de Entrada'!$B$21),IF(H25>0,H25*'Dados de Entrada'!$B$50,0),IF(H$1<'Dados de Entrada'!$B$19+'Dados de Entrada'!$B$18,0,\"\"))","v":3230.2135466136883},{"$f":"IF(AND(I$1>='Dados de Entrada'!$B$19+'Dados de Entrada'!$B$18,I$1<='Dados de Entrada'!$B$21),IF(I25>0,I25*'Dados de Entrada'!$B$50,0),IF(I$1<'Dados de Entrada'!$B$19+'Dados de Entrada'!$B$18,0,\"\"))","v":3230.2135466136883},{"$f":"IF(AND(J$1>='Dados de Entrada'!$B$19+'Dados de Entrada'!$B$18,J$1<='Dados de Entrada'!$B$21),IF(J25>0,J25*'Dados de Entrada'!$B$50,0),IF(J$1<'Dados de Entrada'!$B$19+'Dados de Entrada'!$B$18,0,\"\"))","v":3230.2135466136883},{"$f":"IF(AND(K$1>='Dados de Entrada'!$B$19+'Dados de Entrada'!$B$18,K$1<='Dados de Entrada'!$B$21),IF(K25>0,K25*'Dados de Entrada'!$B$50,0),IF(K$1<'Dados de Entrada'!$B$19+'Dados de Entrada'!$B$18,0,\"\"))","v":3230.2135466136883},{"$f":"IF(AND(L$1>='Dados de Entrada'!$B$19+'Dados de Entrada'!$B$18,L$1<='Dados de Entrada'!$B$21),IF(L25>0,L25*'Dados de Entrada'!$B$50,0),IF(L$1<'Dados de Entrada'!$B$19+'Dados de Entrada'!$B$18,0,\"\"))","v":3230.2135466136883},{"$f":"IF(AND(M$1>='Dados de Entrada'!$B$19+'Dados de Entrada'!$B$18,M$1<='Dados de Entrada'!$B$21),IF(M25>0,M25*'Dados de Entrada'!$B$50,0),IF(M$1<'Dados de Entrada'!$B$19+'Dados de Entrada'!$B$18,0,\"\"))","v":3230.2135466136883},{"$f":"IF(AND(N$1>='Dados de Entrada'!$B$19+'Dados de Entrada'!$B$18,N$1<='Dados de Entrada'!$B$21),IF(N25>0,N25*'Dados de Entrada'!$B$50,0),IF(N$1<'Dados de Entrada'!$B$19+'Dados de Entrada'!$B$18,0,\"\"))","v":3230.2135466136883},{"$f":"IF(AND(O$1>='Dados de Entrada'!$B$19+'Dados de Entrada'!$B$18,O$1<='Dados de Entrada'!$B$21),IF(O25>0,O25*'Dados de Entrada'!$B$50,0),IF(O$1<'Dados de Entrada'!$B$19+'Dados de Entrada'!$B$18,0,\"\"))","v":3230.2135466136883},{"$f":"IF(AND(P$1>='Dados de Entrada'!$B$19+'Dados de Entrada'!$B$18,P$1<='Dados de Entrada'!$B$21),IF(P25>0,P25*'Dados de Entrada'!$B$50,0),IF(P$1<'Dados de Entrada'!$B$19+'Dados de Entrada'!$B$18,0,\"\"))","v":3230.2135466136883},{"$f":"IF(AND(Q$1>='Dados de Entrada'!$B$19+'Dados de Entrada'!$B$18,Q$1<='Dados de Entrada'!$B$21),IF(Q25>0,Q25*'Dados de Entrada'!$B$50,0),IF(Q$1<'Dados de Entrada'!$B$19+'Dados de Entrada'!$B$18,0,\"\"))","v":3230.2135466136883},{"$f":"IF(AND(R$1>='Dados de Entrada'!$B$19+'Dados de Entrada'!$B$18,R$1<='Dados de Entrada'!$B$21),IF(R25>0,R25*'Dados de Entrada'!$B$50,0),IF(R$1<'Dados de Entrada'!$B$19+'Dados de Entrada'!$B$18,0,\"\"))","v":3230.2135466136883},{"$f":"IF(AND(S$1>='Dados de Entrada'!$B$19+'Dados de Entrada'!$B$18,S$1<='Dados de Entrada'!$B$21),IF(S25>0,S25*'Dados de Entrada'!$B$50,0),IF(S$1<'Dados de Entrada'!$B$19+'Dados de Entrada'!$B$18,0,\"\"))","v":3230.2135466136883},{"$f":"IF(AND(T$1>='Dados de Entrada'!$B$19+'Dados de Entrada'!$B$18,T$1<='Dados de Entrada'!$B$21),IF(T25>0,T25*'Dados de Entrada'!$B$50,0),IF(T$1<'Dados de Entrada'!$B$19+'Dados de Entrada'!$B$18,0,\"\"))","v":3230.2135466136883},{"$f":"IF(AND(U$1>='Dados de Entrada'!$B$19+'Dados de Entrada'!$B$18,U$1<='Dados de Entrada'!$B$21),IF(U25>0,U25*'Dados de Entrada'!$B$50,0),IF(U$1<'Dados de Entrada'!$B$19+'Dados de Entrada'!$B$18,0,\"\"))","v":3230.2135466136883},{"$f":"IF(AND(V$1>='Dados de Entrada'!$B$19+'Dados de Entrada'!$B$18,V$1<='Dados de Entrada'!$B$21),IF(V25>0,V25*'Dados de Entrada'!$B$50,0),IF(V$1<'Dados de Entrada'!$B$19+'Dados de Entrada'!$B$18,0,\"\"))","v":3230.2135466136883},{"$f":"IF(AND(W$1>='Dados de Entrada'!$B$19+'Dados de Entrada'!$B$18,W$1<='Dados de Entrada'!$B$21),IF(W25>0,W25*'Dados de Entrada'!$B$50,0),IF(W$1<'Dados de Entrada'!$B$19+'Dados de Entrada'!$B$18,0,\"\"))","v":3230.2135466136883},{"$f":"IF(AND(X$1>='Dados de Entrada'!$B$19+'Dados de Entrada'!$B$18,X$1<='Dados de Entrada'!$B$21),IF(X25>0,X25*'Dados de Entrada'!$B$50,0),IF(X$1<'Dados de Entrada'!$B$19+'Dados de Entrada'!$B$18,0,\"\"))","v":""},{"$f":"IF(AND(Y$1>='Dados de Entrada'!$B$19+'Dados de Entrada'!$B$18,Y$1<='Dados de Entrada'!$B$21),IF(Y25>0,Y25*'Dados de Entrada'!$B$50,0),IF(Y$1<'Dados de Entrada'!$B$19+'Dados de Entrada'!$B$18,0,\"\"))","v":""},{"$f":"IF(AND(Z$1>='Dados de Entrada'!$B$19+'Dados de Entrada'!$B$18,Z$1<='Dados de Entrada'!$B$21),IF(Z25>0,Z25*'Dados de Entrada'!$B$50,0),IF(Z$1<'Dados de Entrada'!$B$19+'Dados de Entrada'!$B$18,0,\"\"))","v":""},{"$f":"IF(AND(AA$1>='Dados de Entrada'!$B$19+'Dados de Entrada'!$B$18,AA$1<='Dados de Entrada'!$B$21),IF(AA25>0,AA25*'Dados de Entrada'!$B$50,0),IF(AA$1<'Dados de Entrada'!$B$19+'Dados de Entrada'!$B$18,0,\"\"))","v":""},{"$f":"IF(AND(AB$1>='Dados de Entrada'!$B$19+'Dados de Entrada'!$B$18,AB$1<='Dados de Entrada'!$B$21),IF(AB25>0,AB25*'Dados de Entrada'!$B$50,0),IF(AB$1<'Dados de Entrada'!$B$19+'Dados de Entrada'!$B$18,0,\"\"))","v":""},{"$f":"IF(AND(AC$1>='Dados de Entrada'!$B$19+'Dados de Entrada'!$B$18,AC$1<='Dados de Entrada'!$B$21),IF(AC25>0,AC25*'Dados de Entrada'!$B$50,0),IF(AC$1<'Dados de Entrada'!$B$19+'Dados de Entrada'!$B$18,0,\"\"))","v":""},{"$f":"IF(AND(AD$1>='Dados de Entrada'!$B$19+'Dados de Entrada'!$B$18,AD$1<='Dados de Entrada'!$B$21),IF(AD25>0,AD25*'Dados de Entrada'!$B$50,0),IF(AD$1<'Dados de Entrada'!$B$19+'Dados de Entrada'!$B$18,0,\"\"))","v":""},{"$f":"IF(AND(AE$1>='Dados de Entrada'!$B$19+'Dados de Entrada'!$B$18,AE$1<='Dados de Entrada'!$B$21),IF(AE25>0,AE25*'Dados de Entrada'!$B$50,0),IF(AE$1<'Dados de Entrada'!$B$19+'Dados de Entrada'!$B$18,0,\"\"))","v":""},{"$f":"IF(AND(AF$1>='Dados de Entrada'!$B$19+'Dados de Entrada'!$B$18,AF$1<='Dados de Entrada'!$B$21),IF(AF25>0,AF25*'Dados de Entrada'!$B$50,0),IF(AF$1<'Dados de Entrada'!$B$19+'Dados de Entrada'!$B$18,0,\"\"))","v":""},{"$f":"IF(AND(AG$1>='Dados de Entrada'!$B$19+'Dados de Entrada'!$B$18,AG$1<='Dados de Entrada'!$B$21),IF(AG25>0,AG25*'Dados de Entrada'!$B$50,0),IF(AG$1<'Dados de Entrada'!$B$19+'Dados de Entrada'!$B$18,0,\"\"))","v":""},{"$f":"IF(AND(AH$1>='Dados de Entrada'!$B$19+'Dados de Entrada'!$B$18,AH$1<='Dados de Entrada'!$B$21),IF(AH25>0,AH25*'Dados de Entrada'!$B$50,0),IF(AH$1<'Dados de Entrada'!$B$19+'Dados de Entrada'!$B$18,0,\"\"))","v":""},{"$f":"IF(AND(AI$1>='Dados de Entrada'!$B$19+'Dados de Entrada'!$B$18,AI$1<='Dados de Entrada'!$B$21),IF(AI25>0,AI25*'Dados de Entrada'!$B$50,0),IF(AI$1<'Dados de Entrada'!$B$19+'Dados de Entrada'!$B$18,0,\"\"))","v":""},{"$f":"IF(AND(AJ$1>='Dados de Entrada'!$B$19+'Dados de Entrada'!$B$18,AJ$1<='Dados de Entrada'!$B$21),IF(AJ25>0,AJ25*'Dados de Entrada'!$B$50,0),IF(AJ$1<'Dados de Entrada'!$B$19+'Dados de Entrada'!$B$18,0,\"\"))","v":""},{"$f":"IF(AND(AK$1>='Dados de Entrada'!$B$19+'Dados de Entrada'!$B$18,AK$1<='Dados de Entrada'!$B$21),IF(AK25>0,AK25*'Dados de Entrada'!$B$50,0),IF(AK$1<'Dados de Entrada'!$B$19+'Dados de Entrada'!$B$18,0,\"\"))","v":""},{"$f":"IF(AND(AL$1>='Dados de Entrada'!$B$19+'Dados de Entrada'!$B$18,AL$1<='Dados de Entrada'!$B$21),IF(AL25>0,AL25*'Dados de Entrada'!$B$50,0),IF(AL$1<'Dados de Entrada'!$B$19+'Dados de Entrada'!$B$18,0,\"\"))","v":""},{"$f":"IF(AND(AM$1>='Dados de Entrada'!$B$19+'Dados de Entrada'!$B$18,AM$1<='Dados de Entrada'!$B$21),IF(AM25>0,AM25*'Dados de Entrada'!$B$50,0),IF(AM$1<'Dados de Entrada'!$B$19+'Dados de Entrada'!$B$18,0,\"\"))","v":""},{"$f":"IF(AND(AN$1>='Dados de Entrada'!$B$19+'Dados de Entrada'!$B$18,AN$1<='Dados de Entrada'!$B$21),IF(AN25>0,AN25*'Dados de Entrada'!$B$50,0),IF(AN$1<'Dados de Entrada'!$B$19+'Dados de Entrada'!$B$18,0,\"\"))","v":""},{"$f":"IF(AND(AO$1>='Dados de Entrada'!$B$19+'Dados de Entrada'!$B$18,AO$1<='Dados de Entrada'!$B$21),IF(AO25>0,AO25*'Dados de Entrada'!$B$50,0),IF(AO$1<'Dados de Entrada'!$B$19+'Dados de Entrada'!$B$18,0,\"\"))","v":""}]
["Receita líquida com a venda de créditos de Carbono (10) = (8) - (9)",{"$f":"IFERROR(B25-B26,\"\")","v":0},{"$f":"IFERROR(C25-C26,\"\")","v":0},18304.5434308109,18304.5434308109,18304.5434308109,18304.5434308109,18304.5434308109,18304.5434308109,18304.5434308109,18304.5434308109,18304.5434308109,18304.5434308109,18304.5434308109,18304.5434308109,18304.5434308109,18304.5434308109,18304.5434308109,18304.5434308109,18304.5434308109,18304.5434308109,18304.5434308109,18304.5434308109,"","","","","","","","","","","","","","","","","",""]
["Capex Total (11) = (11.1) + (11.2)",{"$f":"IFERROR(B29+B30,\"\")","v":3552997.4679282485},{"$f":"IFERROR(C29+C30,\"\")","v":3552997.4679282485},0,0,0,0,0,0,0,0,0,0,0,0,0,0,0,0,0,0,0,0,"","","","","","","","","","","","","","","","","",""]
["Capex da Produção (11.1)",{"$f":"_xlfn.IFS(B$1<'Dados de Entrada'!$B$18+'Dados de Entrada'!$B$19,'Dados de Entrada'!$B$35/'Dados de Entrada'!$B$19,B$1<='Dados de Entrada'!$B$21,0,B$1>'Dados de Entrada'!$B$21,\"\")","v":3552997.4679282485},{"$f":"_xlfn.IFS(C$1<'Dados de Entrada'!$B$18+'Dados de Entrada'!$B$19,'Dados de Entrada'!$B$35/'Dados de Entrada'!$B$19,C$1<='Dados de Entrada'!$B$21,0,C$1>'Dados de Entrada'!$B$21,\"\")","v":3552997.4679282485},{"$f":"_xlfn.IFS(D$1<'Dados de Entrada'!$B$18+'Dados de Entrada'!$B$19,'Dados de Entrada'!$B$35/'Dados de Entrada'!$B$19,D$1<='Dados de Entrada'!$B$21,0,D$1>'Dados de Entrada'!$B$21,\"\")","v":0},{"$f":"_xlfn.IFS(E$1<'Dados de Entrada'!$B$18+'Dados de Entrada'!$B$19,'Dados de Entrada'!$B$35/'Dados de Entrada'!$B$19,E$1<='Dados de Entrada'!$B$21,0,E$1>'Dados de Entrada'!$B$21,\"\")","v":0},{"$f":"_xlfn.IFS(F$1<'Dados de Entrada'!$B$18+'Dados de Entrada'!$B$19,'Dados de Entrada'!$B$35/'Dados de Entrada'!$B$19,F$1<='Dados de Entrada'!$B$21,0,F$1>'Dados de Entrada'!$B$21,\"\")","v":0},{"$f":"_xlfn.IFS(G$1<'Dados de Entrada'!$B$18+'Dados de Entrada'!$B$19,'Dados de Entrada'!$B$35/'Dados de Entrada'!$B$19,G$1<='Dados de Entrada'!$B$21,0,G$1>'Dados de Entrada'!$B$21,\"\")","v":0},{"$f":"_xlfn.IFS(H$1<'Dados de Entrada'!$B$18+'Dados de Entrada'!$B$19,'Dados de Entrada'!$B$35/'Dados de Entrada'!$B$19,H$1<='Dados de Entrada'!$B$21,0,H$1>'Dados de Entrada'!$B$21,\"\")","v":0},{"$f":"_xlfn.IFS(I$1<'Dados de Entrada'!$B$18+'Dados de Entrada'!$B$19,'Dados de Entrada'!$B$35/'Dados de Entrada'!$B$19,I$1<='Dados de Entrada'!$B$21,0,I$1>'Dados de Entrada'!$B$21,\"\")","v":0},{"$f":"_xlfn.IFS(J$1<'Dados de Entrada'!$B$18+'Dados de Entrada'!$B$19,'Dados de Entrada'!$B$35/'Dados de Entrada'!$B$19,J$1<='Dados de Entrada'!$B$21,0,J$1>'Dados de Entrada'!$B$21,\"\")","v":0},{"$f":"_xlfn.IFS(K$1<'Dados de Entrada'!$B$18+'Dados de Entrada'!$B$19,'Dados de Entrada'!$B$35/'Dados de Entrada'!$B$19,K$1<='Dados de Entrada'!$B$21,0,K$1>'Dados de Entrada'!$B$21,\"\")","v":0},{"$f":"_xlfn.IFS(L$1<'Dados de Entrada'!$B$18+'Dados de Entrada'!$B$19,'Dados de Entrada'!$B$35/'Dados de Entrada'!$B$19,L$1<='Dados de Entrada'!$B$21,0,L$1>'Dados de Entrada'!$B$21,\"\")","v":0},{"$f":"_xlfn.IFS(M$1<'Dados de Entrada'!$B$18+'Dados de Entrada'!$B$19,'Dados de Entrada'!$B$35/'Dados de Entrada'!$B$19,M$1<='Dados de Entrada'!$B$21,0,M$1>'Dados de Entrada'!$B$21,\"\")","v":0},{"$f":"_xlfn.IFS(N$1<'Dados de Entrada'!$B$18+'Dados de Entrada'!$B$19,'Dados de Entrada'!$B$35/'Dados de Entrada'!$B$19,N$1<='Dados de Entrada'!$B$21,0,N$1>'Dados de Entrada'!$B$21,\"\")","v":0},{"$f":"_xlfn.IFS(O$1<'Dados de Entrada'!$B$18+'Dados de Entrada'!$B$19,'Dados de Entrada'!$B$35/'Dados de Entrada'!$B$19,O$1<='Dados de Entrada'!$B$21,0,O$1>'Dados de Entrada'!$B$21,\"\")","v":0},{"$f":"_xlfn.IFS(P$1<'Dados de Entrada'!$B$18+'Dados de Entrada'!$B$19,'Dados de Entrada'!$B$35/'Dados de Entrada'!$B$19,P$1<='Dados de Entrada'!$B$21,0,P$1>'Dados de Entrada'!$B$21,\"\")","v":0},{"$f":"_xlfn.IFS(Q$1<'Dados de Entrada'!$B$18+'Dados de Entrada'!$B$19,'Dados de Entrada'!$B$35/'Dados de Entrada'!$B$19,Q$1<='Dados de Entrada'!$B$21,0,Q$1>'Dados de Entrada'!$B$21,\"\")","v":0},{"$f":"_xlfn.IFS(R$1<'Dados de Entrada'!$B$18+'Dados de Entrada'!$B$19,'Dados de Entrada'!$B$35/'Dados de Entrada'!$B$19,R$1<='Dados de Entrada'!$B$21,0,R$1>'Dados de Entrada'!$B$21,\"\")","v":0},{"$f":"_xlfn.IFS(S$1<'Dados de Entrada'!$B$18+'Dados de Entrada'!$B$19,'Dados de Entrada'!$B$35/'Dados de Entrada'!$B$19,S$1<='Dados de Entrada'!$B$21,0,S$1>'Dados de Entrada'!$B$21,\"\")","v":0},{"$f":"_xlfn.IFS(T$1<'Dados de Entrada'!$B$18+'Dados de Entrada'!$B$19,'Dados de Entrada'!$B$35/'Dados de Entrada'!$B$19,T$1<='Dados de Entrada'!$B$21,0,T$1>'Dados de Entrada'!$B$21,\"\")","v":0},{"$f":"_xlfn.IFS(U$1<'Dados de Entrada'!$B$18+'Dados de Entrada'!$B$19,'Dados de Entrada'!$B$35/'Dados de Entrada'!$B$19,U$1<='Dados de Entrada'!$B$21,0,U$1>'Dados de Entrada'!$B$21,\"\")","v":0},{"$f":"_xlfn.IFS(V$1<'Dados de Entrada'!$B$18+'Dados de Entrada'!$B$19,'Dados de Entrada'!$B$35/'Dados de Entrada'!$B$19,V$1<='Dados de Entrada'!$B$21,0,V$1>'Dados de Entrada'!$B$21,\"\")","v":0},{"$f":"_xlfn.IFS(W$1<'Dados de Entrada'!$B$18+'Dados de Entrada'!$B$19,'Dados de Entrada'!$B$35/'Dados de Entrada'!$B$19,W$1<='Dados de Entrada'!$B$21,0,W$1>'Dados de Entrada'!$B$21,\"\")","v":0},{"$f":"_xlfn.IFS(X$1<'Dados de Entrada'!$B$18+'Dados de Entrada'!$B$19,'Dados de Entrada'!$B$35/'Dados de Entrada'!$B$19,X$1<='Dados de Entrada'!$B$21,0,X$1>'Dados de Entrada'!$B$21,\"\")","v":""},{"$f":"_xlfn.IFS(Y$1<'Dados de Entrada'!$B$18+'Dados de Entrada'!$B$19,'Dados de Entrada'!$B$35/'Dados de Entrada'!$B$19,Y$1<='Dados de Entrada'!$B$21,0,Y$1>'Dados de Entrada'!$B$21,\"\")","v":""},{"$f":"_xlfn.IFS(Z$1<'Dados de Entrada'!$B$18+'Dados de Entrada'!$B$19,'Dados de Entrada'!$B$35/'Dados de Entrada'!$B$19,Z$1<='Dados de Entrada'!$B$21,0,Z$1>'Dados de Entrada'!$B$21,\"\")","v":""},{"$f":"_xlfn.IFS(AA$1<'Dados de Entrada'!$B$18+'Dados de Entrada'!$B$19,'Dados de Entrada'!$B$35/'Dados de Entrada'!$B$19,AA$1<='Dados de Entrada'!$B$21,0,AA$1>'Dados de Entrada'!$B$21,\"\")","v":""},{"$f":"_xlfn.IFS(AB$1<'Dados de Entrada'!$B$18+'Dados de Entrada'!$B$19,'Dados de Entrada'!$B$35/'Dados de Entrada'!$B$19,AB$1<='Dados de Entrada'!$B$21,0,AB$1>'Dados de Entrada'!$B$21,\"\")","v":""},{"$f":"_xlfn.IFS(AC$1<'Dados de Entrada'!$B$18+'Dados de Entrada'!$B$19,'Dados de Entrada'!$B$35/'Dados de Entrada'!$B$19,AC$1<='Dados de Entrada'!$B$21,0,AC$1>'Dados de Entrada'!$B$21,\"\")","v":""},{"$f":"_xlfn.IFS(AD$1<'Dados de Entrada'!$B$18+'Dados de Entrada'!$B$19,'Dados de Entrada'!$B$35/'Dados de Entrada'!$B$19,AD$1<='Dados de Entrada'!$B$21,0,AD$1>'Dados de Entrada'!$B$21,\"\")","v":""},{"$f":"_xlfn.IFS(AE$1<'Dados de Entrada'!$B$18+'Dados de Entrada'!$B$19,'Dados de Entrada'!$B$35/'Dados de Entrada'!$B$19,AE$1<='Dados de Entrada'!$B$21,0,AE$1>'Dados de Entrada'!$B$21,\"\")","v":""},{"$f":"_xlfn.IFS(AF$1<'Dados de Entrada'!$B$18+'Dados de Entrada'!$B$19,'Dados de Entrada'!$B$35/'Dados de Entrada'!$B$19,AF$1<='Dados de Entrada'!$B$21,0,AF$1>'Dados de Entrada'!$B$21,\"\")","v":""},{"$f":"_xlfn.IFS(AG$1<'Dados de Entrada'!$B$18+'Dados de Entrada'!$B$19,'Dados de Entrada'!$B$35/'Dados de Entrada'!$B$19,AG$1<='Dados de Entrada'!$B$21,0,AG$1>'Dados de Entrada'!$B$21,\"\")","v":""},{"$f":"_xlfn.IFS(AH$1<'Dados de Entrada'!$B$18+'Dados de Entrada'!$B$19,'Dados de Entrada'!$B$35/'Dados de Entrada'!$B$19,AH$1<='Dados de Entrada'!$B$21,0,AH$1>'Dados de Entrada'!$B$21,\"\")","v":""},{"$f":"_xlfn.IFS(AI$1<'Dados de Entrada'!$B$18+'Dados de Entrada'!$B$19,'Dados de Entrada'!$B$35/'Dados de Entrada'!$B$19,AI$1<='Dados de Entrada'!$B$21,0,AI$1>'Dados de Entrada'!$B$21,\"\")","v":""},{"$f":"_xlfn.IFS(AJ$1<'Dados de Entrada'!$B$18+'Dados de Entrada'!$B$19,'Dados de Entrada'!$B$35/'Dados de Entrada'!$B$19,AJ$1<='Dados de Entrada'!$B$21,0,AJ$1>'Dados de Entrada'!$B$21,\"\")","v":""},{"$f":"_xlfn.IFS(AK$1<'Dados de Entrada'!$B$18+'Dados de Entrada'!$B$19,'Dados de Entrada'!$B$35/'Dados de Entrada'!$B$19,AK$1<='Dados de Entrada'!$B$21,0,AK$1>'Dados de Entrada'!$B$21,\"\")","v":""},{"$f":"_xlfn.IFS(AL$1<'Dados de Entrada'!$B$18+'Dados de Entrada'!$B$19,'Dados de Entrada'!$B$35/'Dados de Entrada'!$B$19,AL$1<='Dados de Entrada'!$B$21,0,AL$1>'Dados de Entrada'!$B$21,\"\")","v":""},{"$f":"_xlfn.IFS(AM$1<'Dados de Entrada'!$B$18+'Dados de Entrada'!$B$19,'Dados de Entrada'!$B$35/'Dados de Entrada'!$B$19,AM$1<='Dados de Entrada'!$B$21,0,AM$1>'Dados de Entrada'!$B$21,\"\")","v":""},{"$f":"_xlfn.IFS(AN$1<'Dados de Entrada'!$B$18+'Dados de Entrada'!$B$19,'Dados de Entrada'!$B$35/'Dados de Entrada'!$B$19,AN$1<='Dados de Entrada'!$B$21,0,AN$1>'Dados de Entrada'!$B$21,\"\")","v":""},{"$f":"_xlfn.IFS(AO$1<'Dados de Entrada'!$B$18+'Dados de Entrada'!$B$19,'Dados de Entrada'!$B$35/'Dados de Entrada'!$B$19,AO$1<='Dados de Entrada'!$B$21,0,AO$1>'Dados de Entrada'!$B$21,\"\")","v":""}]
["Capex do CCS (11.2) = (11.2.1) + (11.2.2)",{"$f":"_xlfn.IFS(B$1<'Dados de Entrada'!$B$18+'Dados de Entrada'!$B$19,SUM(B31:B32),B$1<='Dados de Entrada'!$B$21,0,B$1>'Dados de Entrada'!$B$21,\"\")","v":0},{"$f":"_xlfn.IFS(C$1<'Dados de Entrada'!$B$18+'Dados de Entrada'!$B$19,SUM(C31:C32),C$1<='Dados de Entrada'!$B$21,0,C$1>'Dados de Entrada'!$B$21,\"\")","v":0},{"$f":"_xlfn.IFS(D$1<'Dados de Entrada'!$B$18+'Dados de Entrada'!$B$19,SUM(D31:D32),D$1<='Dados de Entrada'!$B$21,0,D$1>'Dados de Entrada'!$B$21,\"\")","v":0},{"$f":"_xlfn.IFS(E$1<'Dados de Entrada'!$B$18+'Dados de Entrada'!$B$19,SUM(E31:E32),E$1<='Dados de Entrada'!$B$21,0,E$1>'Dados de Entrada'!$B$21,\"\")","v":0},{"$f":"_xlfn.IFS(F$1<'Dados de Entrada'!$B$18+'Dados de Entrada'!$B$19,SUM(F31:F32),F$1<='Dados de Entrada'!$B$21,0,F$1>'Dados de Entrada'!$B$21,\"\")","v":0},{"$f":"_xlfn.IFS(G$1<'Dados de Entrada'!$B$18+'Dados de Entrada'!$B$19,SUM(G31:G32),G$1<='Dados de Entrada'!$B$21,0,G$1>'Dados de Entrada'!$B$21,\"\")","v":0},{"$f":"_xlfn.IFS(H$1<'Dados de Entrada'!$B$18+'Dados de Entrada'!$B$19,SUM(H31:H32),H$1<='Dados de Entrada'!$B$21,0,H$1>'Dados de Entrada'!$B$21,\"\")","v":0},{"$f":"_xlfn.IFS(I$1<'Dados de Entrada'!$B$18+'Dados de Entrada'!$B$19,SUM(I31:I32),I$1<='Dados de Entrada'!$B$21,0,I$1>'Dados de Entrada'!$B$21,\"\")","v":0},{"$f":"_xlfn.IFS(J$1<'Dados de Entrada'!$B$18+'Dados de Entrada'!$B$19,SUM(J31:J32),J$1<='Dados de Entrada'!$B$21,0,J$1>'Dados de Entrada'!$B$21,\"\")","v":0},{"$f":"_xlfn.IFS(K$1<'Dados de Entrada'!$B$18+'Dados de Entrada'!$B$19,SUM(K31:K32),K$1<='Dados de Entrada'!$B$21,0,K$1>'Dados de Entrada'!$B$21,\"\")","v":0},{"$f":"_xlfn.IFS(L$1<'Dados de Entrada'!$B$18+'Dados de Entrada'!$B$19,SUM(L31:L32),L$1<='Dados de Entrada'!$B$21,0,L$1>'Dados de Entrada'!$B$21,\"\")","v":0},{"$f":"_xlfn.IFS(M$1<'Dados de Entrada'!$B$18+'Dados de Entrada'!$B$19,SUM(M31:M32),M$1<='Dados de Entrada'!$B$21,0,M$1>'Dados de Entrada'!$B$21,\"\")","v":0},{"$f":"_xlfn.IFS(N$1<'Dados de Entrada'!$B$18+'Dados de Entrada'!$B$19,SUM(N31:N32),N$1<='Dados de Entrada'!$B$21,0,N$1>'Dados de Entrada'!$B$21,\"\")","v":0},{"$f":"_xlfn.IFS(O$1<'Dados de Entrada'!$B$18+'Dados de Entrada'!$B$19,SUM(O31:O32),O$1<='Dados de Entrada'!$B$21,0,O$1>'Dados de Entrada'!$B$21,\"\")","v":0},{"$f":"_xlfn.IFS(P$1<'Dados de Entrada'!$B$18+'Dados de Entrada'!$B$19,SUM(P31:P32),P$1<='Dados de Entrada'!$B$21,0,P$1>'Dados de Entrada'!$B$21,\"\")","v":0},{"$f":"_xlfn.IFS(Q$1<'Dados de Entrada'!$B$18+'Dados de Entrada'!$B$19,SUM(Q31:Q32),Q$1<='Dados de Entrada'!$B$21,0,Q$1>'Dados de Entrada'!$B$21,\"\")","v":0},{"$f":"_xlfn.IFS(R$1<'Dados de Entrada'!$B$18+'Dados de Entrada'!$B$19,SUM(R31:R32),R$1<='Dados de Entrada'!$B$21,0,R$1>'Dados de Entrada'!$B$21,\"\")","v":0},{"$f":"_xlfn.IFS(S$1<'Dados de Entrada'!$B$18+'Dados de Entrada'!$B$19,SUM(S31:S32),S$1<='Dados de Entrada'!$B$21,0,S$1>'Dados de Entrada'!$B$21,\"\")","v":0},{"$f":"_xlfn.IFS(T$1<'Dados de Entrada'!$B$18+'Dados de Entrada'!$B$19,SUM(T31:T32),T$1<='Dados de Entrada'!$B$21,0,T$1>'Dados de Entrada'!$B$21,\"\")","v":0},{"$f":"_xlfn.IFS(U$1<'Dados de Entrada'!$B$18+'Dados de Entrada'!$B$19,SUM(U31:U32),U$1<='Dados de Entrada'!$B$21,0,U$1>'Dados de Entrada'!$B$21,\"\")","v":0},{"$f":"_xlfn.IFS(V$1<'Dados de Entrada'!$B$18+'Dados de Entrada'!$B$19,SUM(V31:V32),V$1<='Dados de Entrada'!$B$21,0,V$1>'Dados de Entrada'!$B$21,\"\")","v":0},{"$f":"_xlfn.IFS(W$1<'Dados de Entrada'!$B$18+'Dados de Entrada'!$B$19,SUM(W31:W32),W$1<='Dados de Entrada'!$B$21,0,W$1>'Dados de Entrada'!$B$21,\"\")","v":0},{"$f":"_xlfn.IFS(X$1<'Dados de Entrada'!$B$18+'Dados de Entrada'!$B$19,SUM(X31:X32),X$1<='Dados de Entrada'!$B$21,0,X$1>'Dados de Entrada'!$B$21,\"\")","v":""},{"$f":"_xlfn.IFS(Y$1<'Dados de Entrada'!$B$18+'Dados de Entrada'!$B$19,SUM(Y31:Y32),Y$1<='Dados de Entrada'!$B$21,0,Y$1>'Dados de Entrada'!$B$21,\"\")","v":""},{"$f":"_xlfn.IFS(Z$1<'Dados de Entrada'!$B$18+'Dados de Entrada'!$B$19,SUM(Z31:Z32),Z$1<='Dados de Entrada'!$B$21,0,Z$1>'Dados de Entrada'!$B$21,\"\")","v":""},{"$f":"_xlfn.IFS(AA$1<'Dados de Entrada'!$B$18+'Dados de Entrada'!$B$19,SUM(AA31:AA32),AA$1<='Dados de Entrada'!$B$21,0,AA$1>'Dados de Entrada'!$B$21,\"\")","v":""},{"$f":"_xlfn.IFS(AB$1<'Dados de Entrada'!$B$18+'Dados de Entrada'!$B$19,SUM(AB31:AB32),AB$1<='Dados de Entrada'!$B$21,0,AB$1>'Dados de Entrada'!$B$21,\"\")","v":""},{"$f":"_xlfn.IFS(AC$1<'Dados de Entrada'!$B$18+'Dados de Entrada'!$B$19,SUM(AC31:AC32),AC$1<='Dados de Entrada'!$B$21,0,AC$1>'Dados de Entrada'!$B$21,\"\")","v":""},{"$f":"_xlfn.IFS(AD$1<'Dados de Entrada'!$B$18+'Dados de Entrada'!$B$19,SUM(AD31:AD32),AD$1<='Dados de Entrada'!$B$21,0,AD$1>'Dados de Entrada'!$B$21,\"\")","v":""},{"$f":"_xlfn.IFS(AE$1<'Dados de Entrada'!$B$18+'Dados de Entrada'!$B$19,SUM(AE31:AE32),AE$1<='Dados de Entrada'!$B$21,0,AE$1>'Dados de Entrada'!$B$21,\"\")","v":""},{"$f":"_xlfn.IFS(AF$1<'Dados de Entrada'!$B$18+'Dados de Entrada'!$B$19,SUM(AF31:AF32),AF$1<='Dados de Entrada'!$B$21,0,AF$1>'Dados de Entrada'!$B$21,\"\")","v":""},{"$f":"_xlfn.IFS(AG$1<'Dados de Entrada'!$B$18+'Dados de Entrada'!$B$19,SUM(AG31:AG32),AG$1<='Dados de Entrada'!$B$21,0,AG$1>'Dados de Entrada'!$B$21,\"\")","v":""},{"$f":"_xlfn.IFS(AH$1<'Dados de Entrada'!$B$18+'Dados de Entrada'!$B$19,SUM(AH31:AH32),AH$1<='Dados de Entrada'!$B$21,0,AH$1>'Dados de Entrada'!$B$21,\"\")","v":""},{"$f":"_xlfn.IFS(AI$1<'Dados de Entrada'!$B$18+'Dados de Entrada'!$B$19,SUM(AI31:AI32),AI$1<='Dados de Entrada'!$B$21,0,AI$1>'Dados de Entrada'!$B$21,\"\")","v":""},{"$f":"_xlfn.IFS(AJ$1<'Dados de Entrada'!$B$18+'Dados de Entrada'!$B$19,SUM(AJ31:AJ32),AJ$1<='Dados de Entrada'!$B$21,0,AJ$1>'Dados de Entrada'!$B$21,\"\")","v":""},{"$f":"_xlfn.IFS(AK$1<'Dados de Entrada'!$B$18+'Dados de Entrada'!$B$19,SUM(AK31:AK32),AK$1<='Dados de Entrada'!$B$21,0,AK$1>'Dados de Entrada'!$B$21,\"\")","v":""},{"$f":"_xlfn.IFS(AL$1<'Dados de Entrada'!$B$18+'Dados de Entrada'!$B$19,SUM(AL31:AL32),AL$1<='Dados de Entrada'!$B$21,0,AL$1>'Dados de Entrada'!$B$21,\"\")","v":""},{"$f":"_xlfn.IFS(AM$1<'Dados de Entrada'!$B$18+'Dados de Entrada'!$B$19,SUM(AM31:AM32),AM$1<='Dados de Entrada'!$B$21,0,AM$1>'Dados de Entrada'!$B$21,\"\")","v":""},{"$f":"_xlfn.IFS(AN$1<'Dados de Entrada'!$B$18+'Dados de Entrada'!$B$19,SUM(AN31:AN32),AN$1<='Dados de Entrada'!$B$21,0,AN$1>'Dados de Entrada'!$B$21,\"\")","v":""},{"$f":"_xlfn.IFS(AO$1<'Dados de Entrada'!$B$18+'Dados de Entrada'!$B$19,SUM(AO31:AO32),AO$1<='Dados de Entrada'!$B$21,0,AO$1>'Dados de Entrada'!$B$21,\"\")","v":""}]
["Capex da Captura do CO2 (11.2.1)",{"$f":"_xlfn.IFS(B$1<'Dados de Entrada'!$B$18+'Dados de Entrada'!$B$19,'Dados de Entrada'!$B$62/'Dados de Entrada'!$B$19,B$1<='Dados de Entrada'!$B$21,0,B$1>'Dados de Entrada'!$B$21,\"\")","v":0},{"$f":"_xlfn.IFS(C$1<'Dados de Entrada'!$B$18+'Dados de Entrada'!$B$19,'Dados de Entrada'!$B$62/'Dados de Entrada'!$B$19,C$1<='Dados de Entrada'!$B$21,0,C$1>'Dados de Entrada'!$B$21,\"\")","v":0},{"$f":"_xlfn.IFS(D$1<'Dados de Entrada'!$B$18+'Dados de Entrada'!$B$19,'Dados de Entrada'!$B$62/'Dados de Entrada'!$B$19,D$1<='Dados de Entrada'!$B$21,0,D$1>'Dados de Entrada'!$B$21,\"\")","v":0},{"$f":"_xlfn.IFS(E$1<'Dados de Entrada'!$B$18+'Dados de Entrada'!$B$19,'Dados de Entrada'!$B$62/'Dados de Entrada'!$B$19,E$1<='Dados de Entrada'!$B$21,0,E$1>'Dados de Entrada'!$B$21,\"\")","v":0},{"$f":"_xlfn.IFS(F$1<'Dados de Entrada'!$B$18+'Dados de Entrada'!$B$19,'Dados de Entrada'!$B$62/'Dados de Entrada'!$B$19,F$1<='Dados de Entrada'!$B$21,0,F$1>'Dados de Entrada'!$B$21,\"\")","v":0},{"$f":"_xlfn.IFS(G$1<'Dados de Entrada'!$B$18+'Dados de Entrada'!$B$19,'Dados de Entrada'!$B$62/'Dados de Entrada'!$B$19,G$1<='Dados de Entrada'!$B$21,0,G$1>'Dados de Entrada'!$B$21,\"\")","v":0},{"$f":"_xlfn.IFS(H$1<'Dados de Entrada'!$B$18+'Dados de Entrada'!$B$19,'Dados de Entrada'!$B$62/'Dados de Entrada'!$B$19,H$1<='Dados de Entrada'!$B$21,0,H$1>'Dados de Entrada'!$B$21,\"\")","v":0},{"$f":"_xlfn.IFS(I$1<'Dados de Entrada'!$B$18+'Dados de Entrada'!$B$19,'Dados de Entrada'!$B$62/'Dados de Entrada'!$B$19,I$1<='Dados de Entrada'!$B$21,0,I$1>'Dados de Entrada'!$B$21,\"\")","v":0},{"$f":"_xlfn.IFS(J$1<'Dados de Entrada'!$B$18+'Dados de Entrada'!$B$19,'Dados de Entrada'!$B$62/'Dados de Entrada'!$B$19,J$1<='Dados de Entrada'!$B$21,0,J$1>'Dados de Entrada'!$B$21,\"\")","v":0},{"$f":"_xlfn.IFS(K$1<'Dados de Entrada'!$B$18+'Dados de Entrada'!$B$19,'Dados de Entrada'!$B$62/'Dados de Entrada'!$B$19,K$1<='Dados de Entrada'!$B$21,0,K$1>'Dados de Entrada'!$B$21,\"\")","v":0},{"$f":"_xlfn.IFS(L$1<'Dados de Entrada'!$B$18+'Dados de Entrada'!$B$19,'Dados de Entrada'!$B$62/'Dados de Entrada'!$B$19,L$1<='Dados de Entrada'!$B$21,0,L$1>'Dados de Entrada'!$B$21,\"\")","v":0},{"$f":"_xlfn.IFS(M$1<'Dados de Entrada'!$B$18+'Dados de Entrada'!$B$19,'Dados de Entrada'!$B$62/'Dados de Entrada'!$B$19,M$1<='Dados de Entrada'!$B$21,0,M$1>'Dados de Entrada'!$B$21,\"\")","v":0},{"$f":"_xlfn.IFS(N$1<'Dados de Entrada'!$B$18+'Dados de Entrada'!$B$19,'Dados de Entrada'!$B$62/'Dados de Entrada'!$B$19,N$1<='Dados de Entrada'!$B$21,0,N$1>'Dados de Entrada'!$B$21,\"\")","v":0},{"$f":"_xlfn.IFS(O$1<'Dados de Entrada'!$B$18+'Dados de Entrada'!$B$19,'Dados de Entrada'!$B$62/'Dados de Entrada'!$B$19,O$1<='Dados de Entrada'!$B$21,0,O$1>'Dados de Entrada'!$B$21,\"\")","v":0},{"$f":"_xlfn.IFS(P$1<'Dados de Entrada'!$B$18+'Dados de Entrada'!$B$19,'Dados de Entrada'!$B$62/'Dados de Entrada'!$B$19,P$1<='Dados de Entrada'!$B$21,0,P$1>'Dados de Entrada'!$B$21,\"\")","v":0},{"$f":"_xlfn.IFS(Q$1<'Dados de Entrada'!$B$18+'Dados de Entrada'!$B$19,'Dados de Entrada'!$B$62/'Dados de Entrada'!$B$19,Q$1<='Dados de Entrada'!$B$21,0,Q$1>'Dados de Entrada'!$B$21,\"\")","v":0},{"$f":"_xlfn.IFS(R$1<'Dados de Entrada'!$B$18+'Dados de Entrada'!$B$19,'Dados de Entrada'!$B$62/'Dados de Entrada'!$B$19,R$1<='Dados de Entrada'!$B$21,0,R$1>'Dados de Entrada'!$B$21,\"\")","v":0},{"$f":"_xlfn.IFS(S$1<'Dados de Entrada'!$B$18+'Dados de Entrada'!$B$19,'Dados de Entrada'!$B$62/'Dados de Entrada'!$B$19,S$1<='Dados de Entrada'!$B$21,0,S$1>'Dados de Entrada'!$B$21,\"\")","v":0},{"$f":"_xlfn.IFS(T$1<'Dados de Entrada'!$B$18+'Dados de Entrada'!$B$19,'Dados de Entrada'!$B$62/'Dados de Entrada'!$B$19,T$1<='Dados de Entrada'!$B$21,0,T$1>'Dados de Entrada'!$B$21,\"\")","v":0},{"$f":"_xlfn.IFS(U$1<'Dados de Entrada'!$B$18+'Dados de Entrada'!$B$19,'Dados de Entrada'!$B$62/'Dados de Entrada'!$B$19,U$1<='Dados de Entrada'!$B$21,0,U$1>'Dados de Entrada'!$B$21,\"\")","v":0},{"$f":"_xlfn.IFS(V$1<'Dados de Entrada'!$B$18+'Dados de Entrada'!$B$19,'Dados de Entrada'!$B$62/'Dados de Entrada'!$B$19,V$1<='Dados de Entrada'!$B$21,0,V$1>'Dados de Entrada'!$B$21,\"\")","v":0},{"$f":"_xlfn.IFS(W$1<'Dados de Entrada'!$B$18+'Dados de Entrada'!$B$19,'Dados de Entrada'!$B$62/'Dados de Entrada'!$B$19,W$1<='Dados de Entrada'!$B$21,0,W$1>'Dados de Entrada'!$B$21,\"\")","v":0},{"$f":"_xlfn.IFS(X$1<'Dados de Entrada'!$B$18+'Dados de Entrada'!$B$19,'Dados de Entrada'!$B$62/'Dados de Entrada'!$B$19,X$1<='Dados de Entrada'!$B$21,0,X$1>'Dados de Entrada'!$B$21,\"\")","v":""},{"$f":"_xlfn.IFS(Y$1<'Dados de Entrada'!$B$18+'Dados de Entrada'!$B$19,'Dados de Entrada'!$B$62/'Dados de Entrada'!$B$19,Y$1<='Dados de Entrada'!$B$21,0,Y$1>'Dados de Entrada'!$B$21,\"\")","v":""},{"$f":"_xlfn.IFS(Z$1<'Dados de Entrada'!$B$18+'Dados de Entrada'!$B$19,'Dados de Entrada'!$B$62/'Dados de Entrada'!$B$19,Z$1<='Dados de Entrada'!$B$21,0,Z$1>'Dados de Entrada'!$B$21,\"\")","v":""},{"$f":"_xlfn.IFS(AA$1<'Dados de Entrada'!$B$18+'Dados de Entrada'!$B$19,'Dados de Entrada'!$B$62/'Dados de Entrada'!$B$19,AA$1<='Dados de Entrada'!$B$21,0,AA$1>'Dados de Entrada'!$B$21,\"\")","v":""},{"$f":"_xlfn.IFS(AB$1<'Dados de Entrada'!$B$18+'Dados de Entrada'!$B$19,'Dados de Entrada'!$B$62/'Dados de Entrada'!$B$19,AB$1<='Dados de Entrada'!$B$21,0,AB$1>'Dados de Entrada'!$B$21,\"\")","v":""},{"$f":"_xlfn.IFS(AC$1<'Dados de Entrada'!$B$18+'Dados de Entrada'!$B$19,'Dados de Entrada'!$B$62/'Dados de Entrada'!$B$19,AC$1<='Dados de Entrada'!$B$21,0,AC$1>'Dados de Entrada'!$B$21,\"\")","v":""},{"$f":"_xlfn.IFS(AD$1<'Dados de Entrada'!$B$18+'Dados de Entrada'!$B$19,'Dados de Entrada'!$B$62/'Dados de Entrada'!$B$19,AD$1<='Dados de Entrada'!$B$21,0,AD$1>'Dados de Entrada'!$B$21,\"\")","v":""},{"$f":"_xlfn.IFS(AE$1<'Dados de Entrada'!$B$18+'Dados de Entrada'!$B$19,'Dados de Entrada'!$B$62/'Dados de Entrada'!$B$19,AE$1<='Dados de Entrada'!$B$21,0,AE$1>'Dados de Entrada'!$B$21,\"\")","v":""},{"$f":"_xlfn.IFS(AF$1<'Dados de Entrada'!$B$18+'Dados de Entrada'!$B$19,'Dados de Entrada'!$B$62/'Dados de Entrada'!$B$19,AF$1<='Dados de Entrada'!$B$21,0,AF$1>'Dados de Entrada'!$B$21,\"\")","v":""},{"$f":"_xlfn.IFS(AG$1<'Dados de Entrada'!$B$18+'Dados de Entrada'!$B$19,'Dados de Entrada'!$B$62/'Dados de Entrada'!$B$19,AG$1<='Dados de Entrada'!$B$21,0,AG$1>'Dados de Entrada'!$B$21,\"\")","v":""},{"$f":"_xlfn.IFS(AH$1<'Dados de Entrada'!$B$18+'Dados de Entrada'!$B$19,'Dados de Entrada'!$B$62/'Dados de Entrada'!$B$19,AH$1<='Dados de Entrada'!$B$21,0,AH$1>'Dados de Entrada'!$B$21,\"\")","v":""},{"$f":"_xlfn.IFS(AI$1<'Dados de Entrada'!$B$18+'Dados de Entrada'!$B$19,'Dados de Entrada'!$B$62/'Dados de Entrada'!$B$19,AI$1<='Dados de Entrada'!$B$21,0,AI$1>'Dados de Entrada'!$B$21,\"\")","v":""},{"$f":"_xlfn.IFS(AJ$1<'Dados de Entrada'!$B$18+'Dados de Entrada'!$B$19,'Dados de Entrada'!$B$62/'Dados de Entrada'!$B$19,AJ$1<='Dados de Entrada'!$B$21,0,AJ$1>'Dados de Entrada'!$B$21,\"\")","v":""},{"$f":"_xlfn.IFS(AK$1<'Dados de Entrada'!$B$18+'Dados de Entrada'!$B$19,'Dados de Entrada'!$B$62/'Dados de Entrada'!$B$19,AK$1<='Dados de Entrada'!$B$21,0,AK$1>'Dados de Entrada'!$B$21,\"\")","v":""},{"$f":"_xlfn.IFS(AL$1<'Dados de Entrada'!$B$18+'Dados de Entrada'!$B$19,'Dados de Entrada'!$B$62/'Dados de Entrada'!$B$19,AL$1<='Dados de Entrada'!$B$21,0,AL$1>'Dados de Entrada'!$B$21,\"\")","v":""},{"$f":"_xlfn.IFS(AM$1<'Dados de Entrada'!$B$18+'Dados de Entrada'!$B$19,'Dados de Entrada'!$B$62/'Dados de Entrada'!$B$19,AM$1<='Dados de Entrada'!$B$21,0,AM$1>'Dados de Entrada'!$B$21,\"\")","v":""},{"$f":"_xlfn.IFS(AN$1<'Dados de Entrada'!$B$18+'Dados de Entrada'!$B$19,'Dados de Entrada'!$B$62/'Dados de Entrada'!$B$19,AN$1<='Dados de Entrada'!$B$21,0,AN$1>'Dados de Entrada'!$B$21,\"\")","v":""},{"$f":"_xlfn.IFS(AO$1<'Dados de Entrada'!$B$18+'Dados de Entrada'!$B$19,'Dados de Entrada'!$B$62/'Dados de Entrada'!$B$19,AO$1<='Dados de Entrada'!$B$21,0,AO$1>'Dados de Entrada'!$B$21,\"\")","v":""}]
["Capex do Transporte de CO2 (11.2.2)",{"$f":"_xlfn.IFS(B$1<'Dados de Entrada'!$B$18+'Dados de Entrada'!$B$19,'Dados de Entrada'!$B$85/'Dados de Entrada'!$B$19,B$1<='Dados de Entrada'!$B$21,0,B$1>'Dados de Entrada'!$B$21,\"\")","v":0},{"$f":"_xlfn.IFS(C$1<'Dados de Entrada'!$B$18+'Dados de Entrada'!$B$19,'Dados de Entrada'!$B$85/'Dados de Entrada'!$B$19,C$1<='Dados de Entrada'!$B$21,0,C$1>'Dados de Entrada'!$B$21,\"\")","v":0},{"$f":"_xlfn.IFS(D$1<'Dados de Entrada'!$B$18+'Dados de Entrada'!$B$19,'Dados de Entrada'!$B$85/'Dados de Entrada'!$B$19,D$1<='Dados de Entrada'!$B$21,0,D$1>'Dados de Entrada'!$B$21,\"\")","v":0},{"$f":"_xlfn.IFS(E$1<'Dados de Entrada'!$B$18+'Dados de Entrada'!$B$19,'Dados de Entrada'!$B$85/'Dados de Entrada'!$B$19,E$1<='Dados de Entrada'!$B$21,0,E$1>'Dados de Entrada'!$B$21,\"\")","v":0},{"$f":"_xlfn.IFS(F$1<'Dados de Entrada'!$B$18+'Dados de Entrada'!$B$19,'Dados de Entrada'!$B$85/'Dados de Entrada'!$B$19,F$1<='Dados de Entrada'!$B$21,0,F$1>'Dados de Entrada'!$B$21,\"\")","v":0},{"$f":"_xlfn.IFS(G$1<'Dados de Entrada'!$B$18+'Dados de Entrada'!$B$19,'Dados de Entrada'!$B$85/'Dados de Entrada'!$B$19,G$1<='Dados de Entrada'!$B$21,0,G$1>'Dados de Entrada'!$B$21,\"\")","v":0},{"$f":"_xlfn.IFS(H$1<'Dados de Entrada'!$B$18+'Dados de Entrada'!$B$19,'Dados de Entrada'!$B$85/'Dados de Entrada'!$B$19,H$1<='Dados de Entrada'!$B$21,0,H$1>'Dados de Entrada'!$B$21,\"\")","v":0},{"$f":"_xlfn.IFS(I$1<'Dados de Entrada'!$B$18+'Dados de Entrada'!$B$19,'Dados de Entrada'!$B$85/'Dados de Entrada'!$B$19,I$1<='Dados de Entrada'!$B$21,0,I$1>'Dados de Entrada'!$B$21,\"\")","v":0},{"$f":"_xlfn.IFS(J$1<'Dados de Entrada'!$B$18+'Dados de Entrada'!$B$19,'Dados de Entrada'!$B$85/'Dados de Entrada'!$B$19,J$1<='Dados de Entrada'!$B$21,0,J$1>'Dados de Entrada'!$B$21,\"\")","v":0},{"$f":"_xlfn.IFS(K$1<'Dados de Entrada'!$B$18+'Dados de Entrada'!$B$19,'Dados de Entrada'!$B$85/'Dados de Entrada'!$B$19,K$1<='Dados de Entrada'!$B$21,0,K$1>'Dados de Entrada'!$B$21,\"\")","v":0},{"$f":"_xlfn.IFS(L$1<'Dados de Entrada'!$B$18+'Dados de Entrada'!$B$19,'Dados de Entrada'!$B$85/'Dados de Entrada'!$B$19,L$1<='Dados de Entrada'!$B$21,0,L$1>'Dados de Entrada'!$B$21,\"\")","v":0},{"$f":"_xlfn.IFS(M$1<'Dados de Entrada'!$B$18+'Dados de Entrada'!$B$19,'Dados de Entrada'!$B$85/'Dados de Entrada'!$B$19,M$1<='Dados de Entrada'!$B$21,0,M$1>'Dados de Entrada'!$B$21,\"\")","v":0},{"$f":"_xlfn.IFS(N$1<'Dados de Entrada'!$B$18+'Dados de Entrada'!$B$19,'Dados de Entrada'!$B$85/'Dados de Entrada'!$B$19,N$1<='Dados de Entrada'!$B$21,0,N$1>'Dados de Entrada'!$B$21,\"\")","v":0},{"$f":"_xlfn.IFS(O$1<'Dados de Entrada'!$B$18+'Dados de Entrada'!$B$19,'Dados de Entrada'!$B$85/'Dados de Entrada'!$B$19,O$1<='Dados de Entrada'!$B$21,0,O$1>'Dados de Entrada'!$B$21,\"\")","v":0},{"$f":"_xlfn.IFS(P$1<'Dados de Entrada'!$B$18+'Dados de Entrada'!$B$19,'Dados de Entrada'!$B$85/'Dados de Entrada'!$B$19,P$1<='Dados de Entrada'!$B$21,0,P$1>'Dados de Entrada'!$B$21,\"\")","v":0},{"$f":"_xlfn.IFS(Q$1<'Dados de Entrada'!$B$18+'Dados de Entrada'!$B$19,'Dados de Entrada'!$B$85/'Dados de Entrada'!$B$19,Q$1<='Dados de Entrada'!$B$21,0,Q$1>'Dados de Entrada'!$B$21,\"\")","v":0},{"$f":"_xlfn.IFS(R$1<'Dados de Entrada'!$B$18+'Dados de Entrada'!$B$19,'Dados de Entrada'!$B$85/'Dados de Entrada'!$B$19,R$1<='Dados de Entrada'!$B$21,0,R$1>'Dados de Entrada'!$B$21,\"\")","v":0},{"$f":"_xlfn.IFS(S$1<'Dados de Entrada'!$B$18+'Dados de Entrada'!$B$19,'Dados de Entrada'!$B$85/'Dados de Entrada'!$B$19,S$1<='Dados de Entrada'!$B$21,0,S$1>'Dados de Entrada'!$B$21,\"\")","v":0},{"$f":"_xlfn.IFS(T$1<'Dados de Entrada'!$B$18+'Dados de Entrada'!$B$19,'Dados de Entrada'!$B$85/'Dados de Entrada'!$B$19,T$1<='Dados de Entrada'!$B$21,0,T$1>'Dados de Entrada'!$B$21,\"\")","v":0},{"$f":"_xlfn.IFS(U$1<'Dados de Entrada'!$B$18+'Dados de Entrada'!$B$19,'Dados de Entrada'!$B$85/'Dados de Entrada'!$B$19,U$1<='Dados de Entrada'!$B$21,0,U$1>'Dados de Entrada'!$B$21,\"\")","v":0},{"$f":"_xlfn.IFS(V$1<'Dados de Entrada'!$B$18+'Dados de Entrada'!$B$19,'Dados de Entrada'!$B$85/'Dados de Entrada'!$B$19,V$1<='Dados de Entrada'!$B$21,0,V$1>'Dados de Entrada'!$B$21,\"\")","v":0},{"$f":"_xlfn.IFS(W$1<'Dados de Entrada'!$B$18+'Dados de Entrada'!$B$19,'Dados de Entrada'!$B$85/'Dados de Entrada'!$B$19,W$1<='Dados de Entrada'!$B$21,0,W$1>'Dados de Entrada'!$B$21,\"\")","v":0},{"$f":"_xlfn.IFS(X$1<'Dados de Entrada'!$B$18+'Dados de Entrada'!$B$19,'Dados de Entrada'!$B$85/'Dados de Entrada'!$B$19,X$1<='Dados de Entrada'!$B$21,0,X$1>'Dados de Entrada'!$B$21,\"\")","v":""},{"$f":"_xlfn.IFS(Y$1<'Dados de Entrada'!$B$18+'Dados de Entrada'!$B$19,'Dados de Entrada'!$B$85/'Dados de Entrada'!$B$19,Y$1<='Dados de Entrada'!$B$21,0,Y$1>'Dados de Entrada'!$B$21,\"\")","v":""},{"$f":"_xlfn.IFS(Z$1<'Dados de Entrada'!$B$18+'Dados de Entrada'!$B$19,'Dados de Entrada'!$B$85/'Dados de Entrada'!$B$19,Z$1<='Dados de Entrada'!$B$21,0,Z$1>'Dados de Entrada'!$B$21,\"\")","v":""},{"$f":"_xlfn.IFS(AA$1<'Dados de Entrada'!$B$18+'Dados de Entrada'!$B$19,'Dados de Entrada'!$B$85/'Dados de Entrada'!$B$19,AA$1<='Dados de Entrada'!$B$21,0,AA$1>'Dados de Entrada'!$B$21,\"\")","v":""},{"$f":"_xlfn.IFS(AB$1<'Dados de Entrada'!$B$18+'Dados de Entrada'!$B$19,'Dados de Entrada'!$B$85/'Dados de Entrada'!$B$19,AB$1<='Dados de Entrada'!$B$21,0,AB$1>'Dados de Entrada'!$B$21,\"\")","v":""},{"$f":"_xlfn.IFS(AC$1<'Dados de Entrada'!$B$18+'Dados de Entrada'!$B$19,'Dados de Entrada'!$B$85/'Dados de Entrada'!$B$19,AC$1<='Dados de Entrada'!$B$21,0,AC$1>'Dados de Entrada'!$B$21,\"\")","v":""},{"$f":"_xlfn.IFS(AD$1<'Dados de Entrada'!$B$18+'Dados de Entrada'!$B$19,'Dados de Entrada'!$B$85/'Dados de Entrada'!$B$19,AD$1<='Dados de Entrada'!$B$21,0,AD$1>'Dados de Entrada'!$B$21,\"\")","v":""},{"$f":"_xlfn.IFS(AE$1<'Dados de Entrada'!$B$18+'Dados de Entrada'!$B$19,'Dados de Entrada'!$B$85/'Dados de Entrada'!$B$19,AE$1<='Dados de Entrada'!$B$21,0,AE$1>'Dados de Entrada'!$B$21,\"\")","v":""},{"$f":"_xlfn.IFS(AF$1<'Dados de Entrada'!$B$18+'Dados de Entrada'!$B$19,'Dados de Entrada'!$B$85/'Dados de Entrada'!$B$19,AF$1<='Dados de Entrada'!$B$21,0,AF$1>'Dados de Entrada'!$B$21,\"\")","v":""},{"$f":"_xlfn.IFS(AG$1<'Dados de Entrada'!$B$18+'Dados de Entrada'!$B$19,'Dados de Entrada'!$B$85/'Dados de Entrada'!$B$19,AG$1<='Dados de Entrada'!$B$21,0,AG$1>'Dados de Entrada'!$B$21,\"\")","v":""},{"$f":"_xlfn.IFS(AH$1<'Dados de Entrada'!$B$18+'Dados de Entrada'!$B$19,'Dados de Entrada'!$B$85/'Dados de Entrada'!$B$19,AH$1<='Dados de Entrada'!$B$21,0,AH$1>'Dados de Entrada'!$B$21,\"\")","v":""},{"$f":"_xlfn.IFS(AI$1<'Dados de Entrada'!$B$18+'Dados de Entrada'!$B$19,'Dados de Entrada'!$B$85/'Dados de Entrada'!$B$19,AI$1<='Dados de Entrada'!$B$21,0,AI$1>'Dados de Entrada'!$B$21,\"\")","v":""},{"$f":"_xlfn.IFS(AJ$1<'Dados de Entrada'!$B$18+'Dados de Entrada'!$B$19,'Dados de Entrada'!$B$85/'Dados de Entrada'!$B$19,AJ$1<='Dados de Entrada'!$B$21,0,AJ$1>'Dados de Entrada'!$B$21,\"\")","v":""},{"$f":"_xlfn.IFS(AK$1<'Dados de Entrada'!$B$18+'Dados de Entrada'!$B$19,'Dados de Entrada'!$B$85/'Dados de Entrada'!$B$19,AK$1<='Dados de Entrada'!$B$21,0,AK$1>'Dados de Entrada'!$B$21,\"\")","v":""},{"$f":"_xlfn.IFS(AL$1<'Dados de Entrada'!$B$18+'Dados de Entrada'!$B$19,'Dados de Entrada'!$B$85/'Dados de Entrada'!$B$19,AL$1<='Dados de Entrada'!$B$21,0,AL$1>'Dados de Entrada'!$B$21,\"\")","v":""},{"$f":"_xlfn.IFS(AM$1<'Dados de Entrada'!$B$18+'Dados de Entrada'!$B$19,'Dados de Entrada'!$B$85/'Dados de Entrada'!$B$19,AM$1<='Dados de Entrada'!$B$21,0,AM$1>'Dados de Entrada'!$B$21,\"\")","v":""},{"$f":"_xlfn.IFS(AN$1<'Dados de Entrada'!$B$18+'Dados de Entrada'!$B$19,'Dados de Entrada'!$B$85/'Dados de Entrada'!$B$19,AN$1<='Dados de Entrada'!$B$21,0,AN$1>'Dados de Entrada'!$B$21,\"\")","v":""},{"$f":"_xlfn.IFS(AO$1<'Dados de Entrada'!$B$18+'Dados de Entrada'!$B$19,'Dados de Entrada'!$B$85/'Dados de Entrada'!$B$19,AO$1<='Dados de Entrada'!$B$21,0,AO$1>'Dados de Entrada'!$B$21,\"\")","v":""}]
["Fluxo de Caixa (12) = (4) + (7) + (10) - (11)",{"$f":"IFERROR(B19+B24+B27-B28,\"\")","v":-3552997.4679282485},-3552997.4679282485,876400.87374138192,876400.87374138192,876400.87374138192,876400.87374138192,876400.87374138192,876400.87374138192,876400.87374138192,876400.87374138192,876400.87374138192,876400.87374138192,876400.87374138192,876400.87374138192,876400.87374138192,876400.87374138192,876400.87374138192,876400.87374138192,876400.87374138192,876400.87374138192,876400.87374138192,876400.87374138192,"","","","","","","","","","","","","","","","","",""]
[]
["IRR",{"$f":"IRR(B33:AO33)","v":0.10000000000000009}]
["WACC",{"$f":"'Dados de Entrada'!$B$26","v":0.1}]
["VPL",{"$f":"NPV($B$36,B33:AO33)","v":5.2386894822120658E-9}]
[]
[null,"Decomposição (US$/kg)"]
["Preço de Break-even do Hidrogênio (sem estocagem de CO2)",5.758291515734359]
["Preço de Break-even do Hidrogênio",{"$f":"B40+B63","v":5.758291515734359}]
["Opex Total",{"$f":"NPV($B$36,$B4:$AO4)/NPV($B$36,$B$2:$AO$2)","v":4.6989133301657526}]
["Opex da Produção",4.6989133301657526]
["Opex associado ao Etanol",4.2381000000000011]
["Opex associado à Energia Elétrica",7.9900000000000013E-2]
["Opex associado à Água",0.03]
["Opex associado a Outros custos operacionais",0.35091333016575293]
["Opex do CCS",0]
["Opex da Captura de CO2",0]
["Opex associado ao Gás Natural",0]
["Opex associado à Energia Elétrica",0]
["Opex associado a Outros custos operacionais",0]
["Opex do Transporte de CO2",0]
["Opex associado à Energia Elétrica",0]
["Opex associado a Outros custos operacionais",0]
["Imposto de Renda (CSLL + IRPJ)",{"$f":"NPV($B$36,$B23:$AO23)/NPV($B$36,$B$2:$AO$2)","v":0}]
[{"$f":"IF(B57>0,\"Despesas com a compra de créditos de Carbono \",\"Receita com a venda de créditos de Carbono \")","v":"Receita com a venda de créditos de Carbono "},{"$f":"-NPV($B$36,$B27:$AO27)/NPV($B$36,$B$2:$AO$2)","v":-2.2598201766433203E-2}]
["Capex Total",{"$f":"NPV($B$36,$B28:$AO28)/NPV($B$36,$B$2:$AO$2)","v":1.0819763873350385}]
["Capex da Produção",{"$f":"NPV($B$36,$B29:$AO29)/NPV($B$36,$B$2:$AO$2)","v":1.0819763873350385}]
["Capex do CCS",{"$f":"NPV($B$36,$B30:$AO30)/NPV($B$36,$B$2:$AO$2)","v":0}]
["Capex da Captura do CO2",{"$f":"NPV($B$36,$B31:$AO31)/NPV($B$36,$B$2:$AO$2)","v":0}]
["Capex do Transporte de CO2",{"$f":"NPV($B$36,$B32:$AO32)/NPV($B$36,$B$2:$AO$2)","v":0}]
["Estocagem de CO2",{"$f":"'Dados de Entrada'!B100","v":0}]
["Custo Total do CCS por Toneleda de CO2eq capturado",{"$f":"IFERROR((B63+B60+B48)/('Dados de Entrada'!$B$57/('Dados de Entrada'!$B$30*10^3)),0)","v":0}]

{"sheet":"Resultados","index":4,"n_rows":27,"n_cols":3,"rows_kept":27,"cut":false,"hidden":false,"merged":[[2,0,6,0],[0,2,0,15]]}
["Preço de Break-even do Hidrogênio (Dólares por kg)"]
[null,null,"Decomposição (Dólares por kg)"]
[null,"Preço de Break-even do Hidrogênio",5.758291515734359]
[null,"Opex Total",4.6989133301657526]
[null,"Opex da Produção",4.6989133301657526]
[null,"Opex associado ao Etanol",4.2381000000000011]
[null,"Opex associado à Energia Elétrica",7.9900000000000013E-2]
[null,"Opex associado à Água",0.03]
[null,"Opex associado a Outros custos operacionais",0.35091333016575293]
[null,"Opex do CCS",0]
[null,"Opex da Captura de CO2",0]
[null,"Opex associado ao Gás Natural",0]
[null,"Opex associado à Energia Elétrica",0]
[null,"Opex associado a Outros custos operacionais",0]
[null,"Opex do Transporte de CO2",0]
[null,"Opex associado à Energia Elétrica",0]
[null,"Opex associado a Outros custos operacionais",0]
[null,"Imposto de Renda (CSLL + IRPJ)",0]
[null,"Receita com a venda de créditos de Carbono ",-2.2598201766433203E-2]
[null,"Capex Total",1.0819763873350385]
[null,"Capex da Produção",1.0819763873350385]
[null,"Capex do CCS",0]
[null,"Capex da Captura do CO2",0]
[null,"Capex do Transporte de CO2",0]
[null,"Estocagem de CO2",0]
[]
[null,"Custo Total do CCS por Toneleda de CO2eq capturado",0]