{"text_format":"1","workbook":"xlsx","n_sheets":7,"sheets":["(1) Manual de operação","(2) Premissas","(3) Eletrolisadores","(4) Entrada de dados","(5) Simulação e Fluxo de Caixa","(6) Resultados","(7) Análise de sensibilidade"],"not_rendered":{"charts":1,"images":1,"macros":1,"external_links":0,"defined_names":80,"comments":0,"pivot_tables":0},"unopened":[],"bounds":{"document_bytes":16777216,"sheet_cells":100000,"rows_first":2000,"rows_last":500,"rows_between":2000,"halvings":0,"cell_chars":16384,"cell_head_chars":4096},"cells_cut":0,"cells_raw":0,"read":"whole","date_system":"1900"}

{"sheet":"(1) Manual de operação","index":0,"n_rows":0,"n_cols":0,"rows_kept":0,"cut":false,"hidden":false,"merged":[]}

{"sheet":"(2) Premissas","index":1,"n_rows":70,"n_cols":33,"rows_kept":70,"cut":false,"hidden":false,"merged":[]}
[]
[null,"2. Premissas",null,null,null,null,null,null,null,null,null,null,null,null,null,null,null,null,null,null,null,null,null,null,null,null,null,null,null,null,null,null,{"$f":"SUM(AG3:AG1048576)","v":{"$error":"#REF!"}}]
[]
[]
[null,null,null,"Premissas"]
[]
[]
[null,"2.1 Conversores de unidades"]
[null,null,"Conversão de Energia","joule  ","kilowatt-hora  ","Caloria (kcal IT)  ","BTU (IT)  "]
[null,null,"1 J  ",1,2.7777799999999999E-7,2.3884589999999999E-4,9.4781710000000003E-4]
[null,null,"1 kWh  ",3600000,1,859.84522786000002,3412.1416331]
[null,null,"1 kcal (IT)  ",4186.8,1.163E-3,1,3.9683207192999999]
[null,null,"1 BTU (IT)  ",1055.0558526,2.9307109999999998E-4,0.25199576109999999,1]
[]
[null,"2.2 Premissas adicionais",null,null,null,"Valores","Unidade"]
[null,null,null,null,"Fator de coprodução de O2 por eletrólise",8,"kg O2/kg H2"]
[null,null,null,null,"Densidade do O2",{"$f":"0.6998*293.15/273.15","v":0.75103924583562143},"kg/m3"]
[]
[null,"2.3 Lista de combustíveis"]
[null,null,"Combustível","Unidade comercial (S.I.)","Densidade (kg/m3)","Poder calorífico inferior (MJ/S.I.)","Fator de emissão (ton CO2eq/TJ)"]
{"$rows_left_out":51}
{"sheet":"(3) Eletrolisadores","index":2,"n_rows":18,"n_cols":12,"rows_kept":18,"cut":false,"hidden":false,"merged":[]}
[]
[null,"3. Eletrolisadores"]
[]
[null,null,"Modelo","Fabricante","Tecnologia","Pressão de saída [bar]","Potência [kW]","Capacidade de produção [kg/h]","Consumo de energia [kWh/kgH2]","Capacidade específica [Nm3/h/kW]","Capacidade específica [kg/h/kW]","Consumo de água [L/kg H2]"]
[null,null,"(20 MW) HyLYZER® -4.000-30","Cummins","PEM",30,20000,330.8,51,0.2,1.6539999999999999E-2,16.9286578]
[null,null,"(5 MW) HyLYZER® -1.000-30","Cummins","PEM",30,5000,82.7,51.995163239999997,0.2,1.6539999999999999E-2,16.9286578]
[null,null,"(2.5 MW) HyLYZER® -500-30","Cummins","PEM",30,2500,41.35,61.668681980000002,0.2,1.6539999999999999E-2,16.9286578]
[null,null,"(1.25 MW) SiLYZER 200","Siemens","PEM",35,1250,18.607500000000002,62,0.18,1.4886E-2,12.091898430000001]
[null,null,"(1.25 MW) SiLYZER 300","Siemens","PEM",35,1250,18.607500000000002,62,0.18,1.4886E-2,10]
[null,null,"(0.5 MW) HySTAT® - 100","Cummins","ALK",10,500,8.27,57.5,0.2,1.6539999999999999E-2,15]
[null,null,"(0.45 MW) HyProvide - A90","Green Hydrogen","ALK",35,450,8.1,53.6,0.2,1.6539999999999999E-2,10.88270859]
[null,null,"(19.4 MW) Nel A3880","Nel Hydrogen","ALK","1-200",19400,320.87599999999998,53.204353079999997,0.2,1.6539999999999999E-2,10.88270859]
[null,null,"(20 MW) Nel M4000","Nel Hydrogen","PEM",30,20000,330.8,54.776299880000003,0.2,1.6539999999999999E-2,10.88270859]
[null,null,"(2.07 MW) HGAS3SP","ITM Power","PEM",30,2070,36,57.5,0.2,1.7399999999999999E-2,25]
[null,null,"(0.05 MW) HyPEM","NEA","PEM",30,50,0.89880000000000004,55.629728526924787,0.21463343999999998,1.7976000000000002E-2,10]
[null,null,"(5 MW) HyPEM","NEA","PEM",30,5000,89.88,55.629728526924794,0.21463343999999998,1.7975999999999999E-2,10]
[null,null,"(1.2 MW) HyPEM","NEA","PEM",30,1200,17.899999999999999,67.039106145251395,0.17810499999999999,1.4916666666666665E-2,18.994413407821231]
[null,null,"(110 MW) Elyzer","Siemens","PEM",30,110000,2000,55,0.21709090909090906,1.8181818181818181E-2,10]

{"sheet":"(4) Entrada de dados","index":3,"n_rows":122,"n_cols":33,"rows_kept":122,"cut":false,"hidden":false,"merged":[]}
[]
[null,"4. Entradas",null,null,null,null,null,null,null,null,null,null,null,null,null,null,null,null,null,null,null,null,null,null,null,null,null,null,null,null,null,null,{"$f":"SUM(AG3:AG1048576)","v":0}]
[]
[]
[null,null,null,"Conjecturas: Produção de Hidrogênio Verde"]
[]
[null,null,"Código de Cores"]
[null,null,"Informativo"]
[null,null,"Dados de entrada"]
[]
[]
[]
[null,null,"4.1 Diagnóstico e análise preliminar",null,null,"Valor","Unidade","Descrição"]
[null,null,null,null,"Combustível ou fonte fóssil","Gás Natural",null,"Selecionar o combustível fóssil a ser substituído dentro da lista. Caso deseje utilizar outro combustível, a unidade comercial (m3 ou kg), o equivalente energético (MJ/unidade comercial) e o fator de emissão (ton CO2eq/TJ) da fonte devem ser fornecidos nos campos abaixo"]
[null,null,null,null,{"$f":"\"Consumo anual de \"&F14","v":"Consumo anual de Gás Natural"},10000000,{"$f":"INDEX('(2) Premissas'!D21:D26,MATCH('(4) Entrada de dados'!F14,'(2) Premissas'!C21:C26,0))","v":"m3"},"Definir o consumo total anual de combustível fóssil sendo utilizado em um processo, conforme a unidade comercial indicada ao lado"]
[null,null,null,null,"Equivalente energético",{"$f":"INDEX('(2) Premissas'!F21:F26,MATCH('(4) Entrada de dados'!F14,'(2) Premissas'!C21:C26,0))","v":36.843839999999993},{"$f":"\"MJ/\"&Unidade_fonte_substituida","v":"MJ/m3"},"Poder calorífico do combustível selecionado (captado na lista de combustíveis), a ser utilizado na simulação"]
[null,null,null,null,"Fator de emissão",{"$f":"INDEX('(2) Premissas'!G21:G26,MATCH('(4) Entrada de dados'!F14,'(2) Premissas'!C21:C26,0))","v":76.849999999999994},"tonCO2eq/TJ","Fator de emissão do combustível selecionado (captado na lista de combustíveis), a ser utilizado na simulação"]
[null,null,null,null,{"$f":"\"Consumo de energia associado ao uso de \"&F14","v":"Consumo de energia associado ao uso de Gás Natural"},{"$f":"Consumo_FonteFossil*F16*10^-6","v":368.43839999999994},"TJ/ano","Resultado da energia consumida, associado ao combustível selecionado"]
[null,null,null,null,{"$f":"\"Emissões de CO2 associadas ao uso de \"&F14","v":"Emissões de CO2 associadas ao uso de Gás Natural"},{"$f":"F18*fator_emissao_fonte_substituida","v":28314.491039999994},"ton CO2eq/ano","Resultado das emissões de CO2 que o processo proporciona"]
[null,null,null,null,"Substituição desejada da fonte fóssil",0.5,"(-)","Definir o quanto da energia consumida atualmente se deseja ou poder ser substituído por H2"]
{"$rows_left_out":103}
{"sheet":"(5) Simulação e Fluxo de Caixa","index":4,"n_rows":68,"n_cols":34,"rows_kept":68,"cut":false,"hidden":false,"merged":[]}
[]
[null,"5. Simulação da produção de H2, fluxos físicos e fluxo de Caixa"]
[]
[]
[null,null,"5.1 Fluxos físicos",null,null,null,0,1,2,3,4,5,6,7,8,9,10,11,12,13,14,15,16,17,18,19,20,null,"Acumulado no tempo de vida",null,null,null,null,"Descrição do campo"]
[]
[null,null,"Rastreamento da substituição da membrana na tencologia PEM",null,null,null,null,null,null,null,null,null,null,null,null,null,null,null,null,null,null,null,null,null,null,null,null,null,null,null,null,null,null,{"$f":"C7","v":"Rastreamento da substituição da membrana na tencologia PEM"}]
[null,null,"Horas de uso do eletrolisador",null,{"$f":"'(4) Entrada de dados'!G36","v":"h"},null,{"$f":"IF(G5>=posterga,Fator_Operacional*TDT,0)","v":0},0,7884,7884,7884,7884,7884,7884,7884,7884,7884,7884,7884,7884,7884,7884,7884,7884,7884,7884,7884,null,{"$f":"SUM(G8:AA8)","v":149796},null,null,null,{"$f":"E8","v":"h"},{"$f":"C8","v":"Horas de uso do eletrolisador"}]
[null,null,"Horas acumuladas",null,{"$f":"'(4) Entrada de dados'!G36","v":"h"},null,{"$f":"G8+F9","v":0},{"$f":"H8+G9","v":0},{"$f":"I8+H9","v":7884},{"$f":"IF(I10,J8,J8+I9)","v":15768},23652,31536,39420,47304,55188,63072,70956,78840,7884,15768,23652,31536,39420,47304,55188,63072,70956,null,{"$f":"SUM(G9:AA9)","v":788400},null,null,null,{"$f":"E9","v":"h"},{"$f":"C9","v":"Horas acumuladas"}]
[null,null,"Troca membrana",null," ",null,{"$f":"IF(G9>=duracao_membrana,TRUE,FALSE)","v":false},false,false,false,false,false,false,false,false,false,false,true,false,false,false,false,false,false,false,false,false,null,"n/a",null,null,null,{"$f":"E10","v":" "},{"$f":"C10","v":"Troca membrana"}]
[]
[]
[null,null,"Produção (fluxos físicos relacionados a Receitas)",null,null,null,null,null,null,null,null,null,null,null,null,null,null,null,null,null,null,null,null,null,null,null,null,null,null,null,null,null,null,{"$f":"C13","v":"Produção (fluxos físicos relacionados a Receitas)"}]
[null,null,"Produção de Hidrogênio",null,"ton",null,{"$f":"IF(G5=posterga,Prod_H2,0)","v":0},{"$f":"IF(H5=posterga,Prod_H2,0)","v":0},{"$f":"IF(OR(I5=posterga,H10),Prod_H2,H14-(Degradacao_aa_EL*H14))","v":708.61391999999989},701.52778079999985,694.5125029919999,687.56737796207995,680.69170418245915,673.88478714063456,667.14593926922817,660.47447987653584,653.86973507777043,647.33103772699269,708.61391999999989,701.52778079999985,694.5125029919999,687.56737796207995,680.69170418245915,673.88478714063456,667.14593926922817,660.47447987653584,653.86973507777043,null,{"$f":"SUM(G14:AA14)","v":12903.907492328408},null,null,null,{"$f":"E14","v":"ton"},{"$f":"C14","v":"Produção de Hidrogênio"}]
[null,null,"Produção de Oxigênio",null,"milhares m3",null,{"$f":"IF(G5=posterga,Prod_O2*Volume.especifico_O2,0)","v":0},{"$f":"IF(H5=posterga,Prod_O2*Volume.especifico_O2,0)","v":0},{"$f":"IF(OR(I5=posterga,H10),Prod_O2*Volume.especifico_O2,H15-(Degradacao_aa_EL*H15))","v":4257.574912523386},4214.9991633981526,4172.8491717641709,4131.1206800465288,4089.8094732460636,4048.9113785136028,4008.4222647284669,3968.3380420811823,3928.6546616603705,3889.3681150437669,4257.574912523386,4214.9991633981526,4172.8491717641709,4131.1206800465288,4089.8094732460636,4048.9113785136028,4008.4222647284669,3968.3380420811823,3928.6546616603705,null,{"$f":"SUM(G15:AA15)","v":77530.727610967631},null,null,null,{"$f":"E15","v":"milhares m3"},{"$f":"C15","v":"Produção de Oxigênio"}]
[]
[]
[null,null,"Cálculo de insumos evitados (fluxos físicos relacionados a Receitas)",null,null,null,null,null,null,null,null,null,null,null,null,null,null,null,null,null,null,null,null,null,null,null,null,null,null,null,null,null,null,{"$f":"C18","v":"Cálculo de insumos evitados (fluxos físicos relacionados a Receitas)"}]
[null,null,{"$f":"\"Consumo corrente de \"&'(4) Entrada de dados'!F14","v":"Consumo corrente de Gás Natural"},null,{"$f":"Unidade_fonte_substituida","v":"m3"},null,{"$f":"IF(G5>=posterga,-Consumo_FonteFossil,0)","v":0},0,-10000000,-10000000,-10000000,-10000000,-10000000,-10000000,-10000000,-10000000,-10000000,-10000000,-10000000,-10000000,-10000000,-10000000,-10000000,-10000000,-10000000,-10000000,-10000000,null,{"$f":"SUM(G19:AA19)","v":-190000000},null,null,null,{"$f":"E19","v":"m3"},{"$f":"C19","v":"Consumo corrente de Gás Natural"}]
[null,null,{"$f":"\"Consumo corrente de \"&'(4) Entrada de dados'!F14","v":"Consumo corrente de Gás Natural"},null,"TJ",null,{"$f":"PCI_fonte_substituida*G19/10^6","v":0},0,-368.43839999999994,-368.43839999999994,-368.43839999999994,-368.43839999999994,-368.43839999999994,-368.43839999999994,-368.43839999999994,-368.43839999999994,-368.43839999999994,-368.43839999999994,-368.43839999999994,-368.43839999999994,-368.43839999999994,-368.43839999999994,-368.43839999999994,-368.43839999999994,-368.43839999999994,-368.43839999999994,-368.43839999999994,null,{"$f":"SUM(G20:AA20)","v":-7000.3295999999991},null,null,null,{"$f":"E20","v":"TJ"},{"$f":"C20","v":"Consumo corrente de Gás Natural"}]
{"$rows_left_out":49}
{"sheet":"(6) Resultados","index":5,"n_rows":104,"n_cols":32,"rows_kept":104,"cut":false,"hidden":false,"merged":[[8,8,20,10],[8,4,20,6],[26,4,38,6],[44,4,56,6],[44,8,56,10],[30,8,30,10],[31,8,32,10],[36,8,36,10],[37,8,39,10]]}
[]
[null,"6. Resultados",null,null,null,null,null,null,null,null,null,null,null,null,null,null,null,null,null,null,null,null,null,null,null,null,null,null,null,null,null,{"$f":"SUM(AF3:AF1048576)","v":{"$error":"#REF!"}}]
[]
[]
[null,null,"Relatório",null,"CAPEX eletrolisador",null,null,null,null,null,null,null,"Project Cash Flows",null,{"$f":"C85","v":"Fluxos de Caixa"},null,{"$f":"C104","v":"Fluxo de Caixa Acumulado"}]
[]
[null,null,null,null,"Valor Presente Líquido (milhares BRL)",null,null,null,"Período de Payback Simples"]
[null,null,null,null,"VPL do projeto de substituição",null,null,null,"Payback do projeto de substituição"]
[null,null,null,null,{"$f":"G87","v":-54149.280884310137},null,null,null,{"$f":"AC100","v":20}]
[]
[]
[]
[]
[]
[null,null,null,null,null,null,null,null,null,null,null,null,null,null,null,null,null,null,null,null,null,null,null,null,null,null,null,null,null,null,null,{"$f":"#REF!-AC85","v":{"$error":"#REF!"}}]
[]
[]
[]
[]
[]
{"$rows_left_out":85}
{"sheet":"(7) Análise de sensibilidade","index":6,"n_rows":56,"n_cols":33,"rows_kept":56,"cut":false,"hidden":false,"merged":[]}
[]
[null,null,null,"7. Análise de Sensibilidade",null,null,null,null,null,null,null,null,null,null,null,null,null,null,null,null,null,null,null,null,null,null,null,null,null,null,null,null,{"$f":"SUM(AG3:AG1048576)","v":0}]
[]
[]
[null,null,null,"Análise de sensibilidade aplicadas sobre o VPL do projeto de substituição"]
[]
[]
[]
[]
[]
[]
[]
[null,null,null,"7.1 Variação do VPL mantendo-se os parâmetros constantes, exceto: o custo da energia elétrica e o custo da fonte fóssil"]
[]
[null,null,null,null,null,null,{"$f":"'(4) Entrada de dados'!E85","v":"VPL"},{"$f":"'(4) Entrada de dados'!F85","v":"Custo do Gás Natural"},{"$f":"'(4) Entrada de dados'!G85","v":"BRL/m3"}]
[null,null,null,null,null,null,{"$f":"'(4) Entrada de dados'!E86","v":-54149.280884310137},0,0.8,1.6,2.4000000000000004,3.2,4,4.8,5.6,6.3999999999999995,7.1999999999999993]
[null,null,null,null,null,{"$f":"'(4) Entrada de dados'!D87","v":"Custo da energia elétrica"},0,{"$f":"'(4) Entrada de dados'!F87","v":-49849.506688833222},{"$f":"'(4) Entrada de dados'!G87","v":-36320.582254495705},{"$f":"'(4) Entrada de dados'!H87","v":-22791.657820158194},{"$f":"'(4) Entrada de dados'!I87","v":-9262.7333858206803},{"$f":"'(4) Entrada de dados'!J87","v":4266.191048516841},{"$f":"'(4) Entrada de dados'!K87","v":17795.115482854344},{"$f":"'(4) Entrada de dados'!L87","v":31324.039917191869},{"$f":"'(4) Entrada de dados'!M87","v":44852.964351529372},{"$f":"'(4) Entrada de dados'!N87","v":58381.88878586689},{"$f":"'(4) Entrada de dados'!O87","v":71910.813220204393}]
[null,null,null,null,null,{"$f":"'(4) Entrada de dados'!D88","v":"BRL/MWh"},48,{"$f":"'(4) Entrada de dados'!F88","v":-64238.385962266111},{"$f":"'(4) Entrada de dados'!G88","v":-50709.461527928601},{"$f":"'(4) Entrada de dados'!H88","v":-37180.537093591091},{"$f":"'(4) Entrada de dados'!I88","v":-23651.612659253573},{"$f":"'(4) Entrada de dados'!J88","v":-10122.688224916059},{"$f":"'(4) Entrada de dados'!K88","v":3406.2362094214477},{"$f":"'(4) Entrada de dados'!L88","v":16935.160643758958},{"$f":"'(4) Entrada de dados'!M88","v":30464.085078096468},{"$f":"'(4) Entrada de dados'!N88","v":43993.009512433986},{"$f":"'(4) Entrada de dados'!O88","v":57521.933946771504}]
[null,null,null,null,null,null,96,{"$f":"'(4) Entrada de dados'!F89","v":-78627.265235699015},{"$f":"'(4) Entrada de dados'!G89","v":-65098.340801361497},{"$f":"'(4) Entrada de dados'!H89","v":-51569.41636702398},{"$f":"'(4) Entrada de dados'!I89","v":-38040.491932686469},{"$f":"'(4) Entrada de dados'!J89","v":-24511.567498348959},{"$f":"'(4) Entrada de dados'!K89","v":-10982.643064011449},{"$f":"'(4) Entrada de dados'!L89","v":2546.281370326069},{"$f":"'(4) Entrada de dados'!M89","v":16075.205804663572},{"$f":"'(4) Entrada de dados'!N89","v":29604.130239001097},{"$f":"'(4) Entrada de dados'!O89","v":43133.054673338585}]
[null,null,null,null,null,null,144,{"$f":"'(4) Entrada de dados'!F90","v":-93016.144509131904},{"$f":"'(4) Entrada de dados'!G90","v":-79487.220074794401},{"$f":"'(4) Entrada de dados'!H90","v":-65958.295640456883},{"$f":"'(4) Entrada de dados'!I90","v":-52429.37120611938},{"$f":"'(4) Entrada de dados'!J90","v":-38900.446771781855},{"$f":"'(4) Entrada de dados'!K90","v":-25371.522337444345},{"$f":"'(4) Entrada de dados'!L90","v":-11842.597903106838},{"$f":"'(4) Entrada de dados'!M90","v":1686.3265312306758},{"$f":"'(4) Entrada de dados'!N90","v":15215.250965568186},{"$f":"'(4) Entrada de dados'!O90","v":28744.175399905704}]
{"$rows_left_out":36}