{"text_format":"1","workbook":"xlsx","n_sheets":7,"sheets":["(1) Manual de operação","(2) Premissas","(3) Eletrolisadores","(4) Entrada de dados","(5) Simulação e Fluxo de Caixa","(6) Resultados","(7) Análise de sensibilidade"],"not_rendered":{"charts":1,"images":1,"macros":1,"external_links":0,"defined_names":80,"comments":0,"pivot_tables":0},"unopened":[],"bounds":{"document_bytes":16777216,"sheet_cells":100000,"rows_first":2000,"rows_last":500,"rows_between":2000,"halvings":0,"cell_chars":16384,"cell_head_chars":4096},"cells_cut":0,"cells_raw":0,"read":"whole","date_system":"1900"}

{"sheet":"(1) Manual de operação","index":0,"n_rows":0,"n_cols":0,"rows_kept":0,"cut":false,"hidden":false,"merged":[]}

{"sheet":"(2) Premissas","index":1,"n_rows":70,"n_cols":33,"rows_kept":70,"cut":false,"hidden":false,"merged":[]}
[]
[null,"2. Premissas",null,null,null,null,null,null,null,null,null,null,null,null,null,null,null,null,null,null,null,null,null,null,null,null,null,null,null,null,null,null,{"$f":"SUM(AG3:AG1048576)","v":{"$error":"#REF!"}}]
[]
[]
[null,null,null,"Premissas"]
[]
[]
[null,"2.1 Conversores de unidades"]
[null,null,"Conversão de Energia","joule  ","kilowatt-hora  ","Caloria (kcal IT)  ","BTU (IT)  "]
[null,null,"1 J  ",1,2.7777799999999999E-7,2.3884589999999999E-4,9.4781710000000003E-4]
[null,null,"1 kWh  ",3600000,1,859.84522786000002,3412.1416331]
[null,null,"1 kcal (IT)  ",4186.8,1.163E-3,1,3.9683207192999999]
[null,null,"1 BTU (IT)  ",1055.0558526,2.9307109999999998E-4,0.25199576109999999,1]
[]
[null,"2.2 Premissas adicionais",null,null,null,"Valores","Unidade"]
[null,null,null,null,"Fator de coprodução de O2 por eletrólise",8,"kg O2/kg H2"]
[null,null,null,null,"Densidade do O2",{"$f":"0.6998*293.15/273.15","v":0.75103924583562143},"kg/m3"]
[]
[null,"2.3 Lista de combustíveis"]
[null,null,"Combustível","Unidade comercial (S.I.)","Densidade (kg/m3)","Poder calorífico inferior (MJ/S.I.)","Fator de emissão (ton CO2eq/TJ)"]
[null,null,"H2","kg",8.3752093802345065E-2,119.87999999999998,0]
[null,null,"Gás Natural","m3",0.74,36.843839999999993,76.849999999999994]
[null,null,"Carvão","kg","n/a",26.7,98.974999999999994]
[null,null,"Óleo combustível","m3",1000,40151.412000000004,89.87]
[null,null,"Coque de petróleo","kg",1040,35.127251999999999,97.896000000000001]
[null,null,"Outro"]
[]
[]
[]
[]
[]
[]
[]
[]
[]
[]
[]
[]
[]
[]
[]
[]
[]
[]
[]
[]
[]
[]
[]
[]
[]
[]
[]
[]
[]
[]
[]
[]
[]
[]
[]
[]
[]
[]
[]
[]
[]
[]
[]
[null,null,null,null,null,null,null,null,null,null,null,null,null,null,null,null,null,null,null,null,null,null,null,null,null,null,null,null,null,null,null,null,{"$f":"#REF!-#REF!","v":{"$error":"#REF!"}}]

{"sheet":"(3) Eletrolisadores","index":2,"n_rows":18,"n_cols":12,"rows_kept":18,"cut":false,"hidden":false,"merged":[]}
[]
[null,"3. Eletrolisadores"]
[]
[null,null,"Modelo","Fabricante","Tecnologia","Pressão de saída [bar]","Potência [kW]","Capacidade de produção [kg/h]","Consumo de energia [kWh/kgH2]","Capacidade específica [Nm3/h/kW]","Capacidade específica [kg/h/kW]","Consumo de água [L/kg H2]"]
[null,null,"(20 MW) HyLYZER® -4.000-30","Cummins","PEM",30,20000,330.8,51,0.2,1.6539999999999999E-2,16.9286578]
[null,null,"(5 MW) HyLYZER® -1.000-30","Cummins","PEM",30,5000,82.7,51.995163239999997,0.2,1.6539999999999999E-2,16.9286578]
[null,null,"(2.5 MW) HyLYZER® -500-30","Cummins","PEM",30,2500,41.35,61.668681980000002,0.2,1.6539999999999999E-2,16.9286578]
[null,null,"(1.25 MW) SiLYZER 200","Siemens","PEM",35,1250,18.607500000000002,62,0.18,1.4886E-2,12.091898430000001]
[null,null,"(1.25 MW) SiLYZER 300","Siemens","PEM",35,1250,18.607500000000002,62,0.18,1.4886E-2,10]
[null,null,"(0.5 MW) HySTAT® - 100","Cummins","ALK",10,500,8.27,57.5,0.2,1.6539999999999999E-2,15]
[null,null,"(0.45 MW) HyProvide - A90","Green Hydrogen","ALK",35,450,8.1,53.6,0.2,1.6539999999999999E-2,10.88270859]
[null,null,"(19.4 MW) Nel A3880","Nel Hydrogen","ALK","1-200",19400,320.87599999999998,53.204353079999997,0.2,1.6539999999999999E-2,10.88270859]
[null,null,"(20 MW) Nel M4000","Nel Hydrogen","PEM",30,20000,330.8,54.776299880000003,0.2,1.6539999999999999E-2,10.88270859]
[null,null,"(2.07 MW) HGAS3SP","ITM Power","PEM",30,2070,36,57.5,0.2,1.7399999999999999E-2,25]
[null,null,"(0.05 MW) HyPEM","NEA","PEM",30,50,0.89880000000000004,55.629728526924787,0.21463343999999998,1.7976000000000002E-2,10]
[null,null,"(5 MW) HyPEM","NEA","PEM",30,5000,89.88,55.629728526924794,0.21463343999999998,1.7975999999999999E-2,10]
[null,null,"(1.2 MW) HyPEM","NEA","PEM",30,1200,17.899999999999999,67.039106145251395,0.17810499999999999,1.4916666666666665E-2,18.994413407821231]
[null,null,"(110 MW) Elyzer","Siemens","PEM",30,110000,2000,55,0.21709090909090906,1.8181818181818181E-2,10]

{"sheet":"(4) Entrada de dados","index":3,"n_rows":122,"n_cols":33,"rows_kept":122,"cut":false,"hidden":false,"merged":[]}
[]
[null,"4. Entradas",null,null,null,null,null,null,null,null,null,null,null,null,null,null,null,null,null,null,null,null,null,null,null,null,null,null,null,null,null,null,{"$f":"SUM(AG3:AG1048576)","v":0}]
[]
[]
[null,null,null,"Conjecturas: Produção de Hidrogênio Verde"]
[]
[null,null,"Código de Cores"]
[null,null,"Informativo"]
[null,null,"Dados de entrada"]
[]
[]
[]
[null,null,"4.1 Diagnóstico e análise preliminar",null,null,"Valor","Unidade","Descrição"]
[null,null,null,null,"Combustível ou fonte fóssil","Gás Natural",null,"Selecionar o combustível fóssil a ser substituído dentro da lista. Caso deseje utilizar outro combustível, a unidade comercial (m3 ou kg), o equivalente energético (MJ/unidade comercial) e o fator de emissão (ton CO2eq/TJ) da fonte devem ser fornecidos nos campos abaixo"]
[null,null,null,null,{"$f":"\"Consumo anual de \"&F14","v":"Consumo anual de Gás Natural"},10000000,{"$f":"INDEX('(2) Premissas'!D21:D26,MATCH('(4) Entrada de dados'!F14,'(2) Premissas'!C21:C26,0))","v":"m3"},"Definir o consumo total anual de combustível fóssil sendo utilizado em um processo, conforme a unidade comercial indicada ao lado"]
[null,null,null,null,"Equivalente energético",{"$f":"INDEX('(2) Premissas'!F21:F26,MATCH('(4) Entrada de dados'!F14,'(2) Premissas'!C21:C26,0))","v":36.843839999999993},{"$f":"\"MJ/\"&Unidade_fonte_substituida","v":"MJ/m3"},"Poder calorífico do combustível selecionado (captado na lista de combustíveis), a ser utilizado na simulação"]
[null,null,null,null,"Fator de emissão",{"$f":"INDEX('(2) Premissas'!G21:G26,MATCH('(4) Entrada de dados'!F14,'(2) Premissas'!C21:C26,0))","v":76.849999999999994},"tonCO2eq/TJ","Fator de emissão do combustível selecionado (captado na lista de combustíveis), a ser utilizado na simulação"]
[null,null,null,null,{"$f":"\"Consumo de energia associado ao uso de \"&F14","v":"Consumo de energia associado ao uso de Gás Natural"},{"$f":"Consumo_FonteFossil*F16*10^-6","v":368.43839999999994},"TJ/ano","Resultado da energia consumida, associado ao combustível selecionado"]
[null,null,null,null,{"$f":"\"Emissões de CO2 associadas ao uso de \"&F14","v":"Emissões de CO2 associadas ao uso de Gás Natural"},{"$f":"F18*fator_emissao_fonte_substituida","v":28314.491039999994},"ton CO2eq/ano","Resultado das emissões de CO2 que o processo proporciona"]
[null,null,null,null,"Substituição desejada da fonte fóssil",0.5,"(-)","Definir o quanto da energia consumida atualmente se deseja ou poder ser substituído por H2"]
[null,null,null,null,{"$f":"\"A substituição reduzirá o consumo de \"&F14&\" em\"","v":"A substituição reduzirá o consumo de Gás Natural em"},{"$f":"F20*F18","v":184.21919999999997},"TJ/ano","Resultado de quanto da energia sera substituída pelo uso de H2"]
[null,null,null,null,"As emissões evitadas, segundo a substituição, seriam de",{"$f":"F21*fator_emissao_fonte_substituida","v":14157.245519999997},"ton CO2eq/ano","Resultado da redução de emissões esperada ao deixar de utilizar a fonte fóssil tradicional"]
[null,null,null,null,"Uso de H2 sustentável para promover a substituição",{"$f":"F21/(PCI_H2/10^3)","v":1536.6966966966966},"ton H2/ano","Resultado da quantidade de H2 sustentável seria necessário para realizar a substituição"]
[null,null,null,null,"Capacidade de eletrólise sugerida para atender a substituição",{"$f":"F23*58/365/24","v":10.174475845708722},"MW","Sugestão da capacidade instalada de eletrólise para se iniciar a avaliação. Considera-se o uso de 100% da capacidade de um eletrolisador, com uma eficiência de 58 kWh/kg. Esse valor pode ser utilizado como referência para a seleção do eletrolisador do projeto."]
[]
[null,null,"4.2 Preços e custos de insumos",null,null,"Valor","Unidade","Descrição"]
[null,null,null,null,"Moeda","BRL",null,"Moeda adotada para as entradas de preços e custos"]
[null,null,null,null,{"$f":"\"Custo do \"&F14&\"\"","v":"Custo do Gás Natural"},4,{"$f":"Moeda&\"/\"&Unidade_fonte_substituida","v":"BRL/m3"},"Custo da fonte fóssil atualmente utilizada, relacionado ao ganho virtual de receita ao se evitar o uso da fonte fóssil, devido ao uso do H2 como substituto"]
[null,null,null,null,"Custo da água consumida pelo eletrolisador",6,{"$f":"Moeda&\"/m3\"","v":"BRL/m3"},"Custo associado ao consumo específico de H2O para o eletrolisador produzir H2 e O2"]
[null,null,null,null,"Preço de oportunidade para o O2",0,{"$f":"Moeda&\"/m3\"","v":"BRL/m3"},"Preço de ganho de receita pelo O2 por meios comerciais ou outras oportunidades consideradas pelo projetista (redução de compra de matéria-prima, redução de consumo de combustível recorrendo à queima com atmosfera enriquecida)"]
[null,null,null,null,"Custo da energia elétrica",240,{"$f":"Moeda&\"/MWh\"","v":"BRL/MWh"},"Custo associado a energia elétrica acessível à fábrica"]
[null,null,null,null,"Preço do crédito de carbono",0,{"$f":"Moeda&\"/ton CO2\"","v":"BRL/ton CO2"},"Preço representativo do crédito de carbono, acessível em mercados regulados ou voluntários"]
[]
[null,null,"4.3 Condições operacionais do projeto",null,null,"Valor","Unidade","Descrição"]
[null,null,null,null,"Fator Operacional",0.9,"(-)","Expectativa de operação do projeto, aplicável sobre o fator de capacidade do eletrolisador e a operação da fábrica"]
[null,null,null,null,"Total de horas trabalhadas em um ano",8760,"h","Total de horas em que a operação ocorre em 1 ano"]
[null,null,null,null,"Distribuição do investimento",0.8,"no ano 0","Inserir o percentual do investimento (CAPEX) que será aportado no 1o ano de investimento"]
[null,null,null,null,null,0.2,"no ano 1","Inserir o percentual do investimento (CAPEX) que será aportado no 20 ano de investimento"]
[null,null,null,null,null,0,"no ano 2","Inserir o percentual do investimento (CAPEX) que será aportado no 3o ano de investimento"]
[null,null,null,null,null,0,"no ano 3","Inserir o percentual do investimento (CAPEX) que será aportado no 4o ano de investimento"]
[null,null,null,null,null,0,"no ano 4","Inserir o percentual do investimento (CAPEX) que será aportado no 5o ano de investimento"]
[null,null,null,null,"Soma da distribuição",{"$f":"SUM(F37:F41)","v":1},{"$f":"IF(F42 = 100%,\"(-)\",\"REVISAR DISTRIBUIÇÃO\")","v":"(-)"},"Atentar para a distribuição compor 100%. Se diferente, revisar a distribuição"]
[null,null,null,null,"Período de investimeto",{"$f":"COUNTIF(F37:F41,\">0\")","v":2},"anos","Este campo determina o número de anos para implementação do investimento, e o ano a partir do qual se tem a operação do projeto"]
[null,null,null,null,"Taxa de Desconto",0.1,"a.a.","Taxa de desconto real aplicável sobre os montantes financeiros incidentes no fluxo de caixa"]
[]
[null,null,"4.4 Seção de eletrolisadores",null,null,null,null,"Descrição"]
[null,null,null,null,"Custo unitário do eletrolisador por unidade de potência instalada",6000,{"$f":"Moeda&\"/kW\"","v":"BRL/kW"},"Custo unitário do eletrolisador, por unidade de potência instalada do eletrolisador."]
[null,null,null,null,"Taxa de degradação do eletrolisador",0.01,"a.a.","Redução da capacidade do eletrolisador de produzir H2, utilizando-se do mesmo consumo de energia elétrica"]
[]
[null,null,"4.5 Seleção de eletrolisadores - utilizar lista existente de eletrolisadores ou introduzir um eletrolisador com suas especificações técnicas",null,null,null,null,null,null,null,null,null,null,null,"Valores anuais"]
[null,null,"Qtd","Modelo","Fabricante","Tecnologia","Pressão de saída [bar]","Potência [kW]","Capacidade de produção [kg/h]","Consumo de energia [kWh/kgH2]","Capacidade específica [Nm3/h/kW]","Capacidade específica [kg/h/kW]","Consumo de água [L/kg H2]","Custo do eletrolisador","Produção H2 [ton/ano]","Produção O2 [ton/ano]","Consumo água [m3/ano]","Consumo de energia elétrica [MWh/ano]","Descrição"]
[null,null,1,"(5 MW) HyPEM",{"$f":"VLOOKUP($D$52,'(3) Eletrolisadores'!$C$4:$L$18,(COUNTA($D$52:D52)+1),0)","v":"NEA"},{"$f":"VLOOKUP($D$52,'(3) Eletrolisadores'!$C$4:$L$18,(COUNTA($D$52:E52)+1),0)","v":"PEM"},{"$f":"VLOOKUP($D$52,'(3) Eletrolisadores'!$C$4:$L$18,(COUNTA($D$52:F52)+1),0)","v":30},{"$f":"VLOOKUP($D$52,'(3) Eletrolisadores'!$C$4:$L$18,(COUNTA($D$52:G52)+1),0)","v":5000},{"$f":"VLOOKUP($D$52,'(3) Eletrolisadores'!$C$4:$L$18,(COUNTA($D$52:H52)+1),0)","v":89.88},{"$f":"VLOOKUP($D$52,'(3) Eletrolisadores'!$C$4:$L$18,(COUNTA($D$52:I52)+1),0)","v":55.629728526924794},{"$f":"VLOOKUP($D$52,'(3) Eletrolisadores'!$C$4:$L$18,(COUNTA($D$52:J52)+1),0)","v":0.21463343999999998},{"$f":"VLOOKUP($D$52,'(3) Eletrolisadores'!$C$4:$L$18,(COUNTA($D$52:K52)+1),0)","v":1.7975999999999999E-2},{"$f":"VLOOKUP($D$52,'(3) Eletrolisadores'!$C$4:$L$18,(COUNTA($D$52:L52)+1),0)","v":10},{"$f":"Custo.Uni_ELET*H52*C52","v":30000000},{"$f":"I52*TDT*Fator_Operacional/10^3*C52","v":708.61391999999989},{"$f":"I52*O2_kg_por_H2_kg*TDT*Fator_Operacional/10^3*C52","v":5668.9113599999991},{"$f":"-M52*I52*TDT*Fator_Operacional/10^3*C52","v":-7086.1392000000005},{"$f":"-J52*I52*TDT*Fator_Operacional/10^3*C52","v":-39420},"Selecione um eletrolisador na lista, bem como a quantidade desejada."]
[null,null,0,"(20 MW) HyLYZER® -4.000-30",{"$f":"VLOOKUP($D$53,'(3) Eletrolisadores'!$C$4:$L$18,(COUNTA($D$53:D53)+1),0)","v":"Cummins"},{"$f":"VLOOKUP($D$53,'(3) Eletrolisadores'!$C$4:$L$18,(COUNTA($D$53:E53)+1),0)","v":"PEM"},{"$f":"VLOOKUP($D$53,'(3) Eletrolisadores'!$C$4:$L$18,(COUNTA($D$53:F53)+1),0)","v":30},{"$f":"VLOOKUP($D$53,'(3) Eletrolisadores'!$C$4:$L$18,(COUNTA($D$53:G53)+1),0)","v":20000},{"$f":"VLOOKUP($D$53,'(3) Eletrolisadores'!$C$4:$L$18,(COUNTA($D$53:H53)+1),0)","v":330.8},{"$f":"VLOOKUP($D$53,'(3) Eletrolisadores'!$C$4:$L$18,(COUNTA($D$53:I53)+1),0)","v":51},{"$f":"VLOOKUP($D$53,'(3) Eletrolisadores'!$C$4:$L$18,(COUNTA($D$53:J53)+1),0)","v":0.2},{"$f":"VLOOKUP($D$53,'(3) Eletrolisadores'!$C$4:$L$18,(COUNTA($D$53:K53)+1),0)","v":1.6539999999999999E-2},{"$f":"VLOOKUP($D$53,'(3) Eletrolisadores'!$C$4:$L$18,(COUNTA($D$53:L53)+1),0)","v":16.9286578},{"$f":"Custo.Uni_ELET*H53*C53","v":0},{"$f":"I53*TDT*Fator_Operacional/10^3*C53","v":0},{"$f":"I53*O2_kg_por_H2_kg*TDT*Fator_Operacional/10^3*C53","v":0},{"$f":"-M53*I53*TDT*Fator_Operacional/10^3*C53","v":0},{"$f":"-J53*I53*TDT*Fator_Operacional/10^3*C53","v":0},"Selecione um eletrolisador na lista, bem como a quantidade desejada."]
[null,null,0,"Outro","AB","ALK",30,10000,{"$f":"H54/J54","v":192.30769230769232},52,{"$f":"I54/Densidade_H2/H54","v":0.22961538461538461},{"$f":"I54/H54","v":1.9230769230769232E-2},15,{"$f":"Custo.Uni_ELET*H54*C54","v":0},{"$f":"I54*TDT*Fator_Operacional/10^3*C54","v":0},{"$f":"I54*O2_kg_por_H2_kg*TDT*Fator_Operacional/10^3*C54","v":0},{"$f":"-M54*I54*TDT*Fator_Operacional/10^3*C54","v":0},{"$f":"-J54*I54*TDT*Fator_Operacional/10^3*C54","v":0},"Este espaço permite ao usuário considerar um eletrolisador ausente na lista sugerida. Os espaços com fundo cinza destacam valores introduzidos na simulação, portanto devem ser preenchidos"]
[null,null,null,null,null,null,"Sumário do sistema de eletrólise",{"$f":"SUMPRODUCT(H52:H54,C52:C54)","v":5000},{"$f":"SUMPRODUCT(I52:I54,C52:C54)","v":89.88},{"$f":"SUMPRODUCT(I52:I54,J52:J54,C52:C54)/SUMPRODUCT(I52:I54,C52:C54)","v":55.629728526924794},{"$f":"L55/Densidade_H2","v":0.21463343999999998},{"$f":"I55/H55","v":1.7975999999999999E-2},{"$f":"SUMPRODUCT(M52:M54,O52:O54)/SUM(O52:O54)","v":10},{"$f":"SUM(N52:N54)","v":30000000},{"$f":"SUM(O52:O54)","v":708.61391999999989},{"$f":"SUM(P52:P54)","v":5668.9113599999991},{"$f":"SUM(Q52:Q54)","v":-7086.1392000000005},{"$f":"SUM(R52:R54)","v":-39420},"Os resultados neste sumário serão utilizados na simulação"]
[null,null,null,null,null,"Alerta de alinhamento com a concepção inicial:","A potência instalada é",{"$f":"TRUNC(H55/F24/1000-1,1)","v":-0.5},{"$f":"IF(H56>0,\"maior que a sugestão do diagnóstico\",\"menor que a sugestão do diagnóstico\")","v":"menor que a sugestão do diagnóstico"}]
[]
[null,null,"4.6 Custos de capital e operacionais do eletrolisador "]
[null,null,null,null,"Orçamento de Investimento","Valor","Moeda","% do Eletrolisador",null,"Custos de Operação  ",null,"Valor","Moeda","% do Eletrolisador","Periodicidade"]
[null,null,null,null,"Eletrolisadores  ",{"$f":"-N55","v":-30000000},{"$f":"Moeda","v":"BRL"},"(-)",null,null,"Operação e Manutenção  ",{"$f":"N60*$F$60","v":-300000},{"$f":"Moeda","v":"BRL"},0.01,"a.a."]
[null,null,null,null,"Armazenamento de H2  ",{"$f":"H61*$F$60","v":0},"BRL",0,null,null,"Outros custos  ",{"$f":"N61*$F$60","v":-300000},{"$f":"Moeda","v":"BRL"},0.01,"a.a."]
[null,null,null,null,"Armazenamento de O2  ",0,"BRL",0,null,null,"Demais custos",0,{"$f":"Moeda","v":"BRL"}]
[null,null,null,null,"Importação equipamento  ",-4500000,"BRL",0.15,null,null,"Troca da membrana  ",{"$f":"N63*$F$60","v":-6000000},{"$f":"Moeda","v":"BRL"},0.2,75000,"horas"]
[null,null,null,null,"Preparo do local: mão de obra  ",-2700000,"BRL",0.09]
[null,null,null,null,"Preparo do local: material  ",-3000000,"BRL",0.1]
[null,null,null,null,"Engenharia e licenciamento  ",-300000,"BRL",0.01,null,"Valores Residuais  "]
[null,null,null,null,"Outras contingências  ",-4500000,"BRL",0.15,null,null,"Valor residual no último ano  ",{"$f":"-F60*N67","v":8888888.8888888881},{"$f":"Moeda","v":"BRL"},{"$f":"(27-21+posterga)/27","v":0.29629629629629628}]
[null,null,null,null,"Demais custos",0,"BRL","(-)"]
[]
[null,null,null,null,"Investimento no sistema de eletrólise",{"$f":"SUM(F60:F69)","v":-45000000},"BRL","Cálculo do investimento do eletrolisador"]
[null,null,null,null,"CAPEX do eletrolisador",{"$f":"F70","v":-45000000},"BRL","CAPEX a ser utilizado no fluxo de caixa. Neste campo pode ser inserido o valor do CAPEX que se deseja considerar na simulação"]
[]
[]
[]
[]
[]
[]
[]
[]
[]
[]
[null,null,"Análise de sensibilidade - Esta seção deve ficar oculta para fins de se concentrar os resultados na Aba adequada. A análise de sensibilidade está construída nesta parte, pois as variáveis e a Tabela de Dados (ferramenta utilizada do Excel) devem estar contidas em uma mesma Aba"]
[]
[]
[null,null,null,null,"VPL",{"$f":"E28","v":"Custo do Gás Natural"},{"$f":"G28","v":"BRL/m3"}]
[null,null,null,null,{"$f":"'(6) Resultados'!E9","v":-54149.280884310137},{"$f":"'(7) Análise de sensibilidade'!H16","v":0},{"$f":"'(7) Análise de sensibilidade'!I16","v":0.8},{"$f":"'(7) Análise de sensibilidade'!J16","v":1.6},{"$f":"'(7) Análise de sensibilidade'!K16","v":2.4000000000000004},{"$f":"'(7) Análise de sensibilidade'!L16","v":3.2},{"$f":"'(7) Análise de sensibilidade'!M16","v":4},{"$f":"'(7) Análise de sensibilidade'!N16","v":4.8},{"$f":"'(7) Análise de sensibilidade'!O16","v":5.6},{"$f":"'(7) Análise de sensibilidade'!P16","v":6.3999999999999995},{"$f":"'(7) Análise de sensibilidade'!Q16","v":7.1999999999999993}]
[null,null,null,{"$f":"E31","v":"Custo da energia elétrica"},{"$f":"'(7) Análise de sensibilidade'!G17","v":0},-49849.506688833222,-36320.582254495705,-22791.657820158194,-9262.7333858206803,4266.191048516841,17795.115482854344,31324.039917191869,44852.964351529372,58381.88878586689,71910.813220204393]
[null,null,null,{"$f":"G31","v":"BRL/MWh"},{"$f":"'(7) Análise de sensibilidade'!G18","v":48},-64238.385962266111,-50709.461527928601,-37180.537093591091,-23651.612659253573,-10122.688224916059,3406.2362094214477,16935.160643758958,30464.085078096468,43993.009512433986,57521.933946771504]
[null,null,null,null,{"$f":"'(7) Análise de sensibilidade'!G19","v":96},-78627.265235699015,-65098.340801361497,-51569.41636702398,-38040.491932686469,-24511.567498348959,-10982.643064011449,2546.281370326069,16075.205804663572,29604.130239001097,43133.054673338585]
[null,null,null,null,{"$f":"'(7) Análise de sensibilidade'!G20","v":144},-93016.144509131904,-79487.220074794401,-65958.295640456883,-52429.37120611938,-38900.446771781855,-25371.522337444345,-11842.597903106838,1686.3265312306758,15215.250965568186,28744.175399905704]
[null,null,null,null,{"$f":"'(7) Análise de sensibilidade'!G21","v":192},-107405.02378256482,-93876.09934822729,-80347.174913889772,-66818.250479552284,-53289.326045214752,-39760.401610877241,-26231.477176539731,-12702.552742202221,826.3716921352825,14355.2961264728]
[null,null,null,null,{"$f":"'(7) Análise de sensibilidade'!G22","v":240},-121793.9030559977,-108264.97862166018,-94736.054187322676,-81207.129752985158,-67678.205318647641,-54149.280884310137,-40620.356449972627,-27091.432015635117,-13562.507581297603,-33.583146960096201]
[null,null,null,null,{"$f":"'(7) Análise de sensibilidade'!G23","v":288},-136182.78232943063,-122653.85789509307,-109124.93346075558,-95596.009026418033,-82067.084592080559,-68538.160157743041,-55009.235723405523,-41480.311289068013,-27951.386854730503,-14422.462420392989]
[null,null,null,null,{"$f":"'(7) Análise de sensibilidade'!G24","v":336},-150571.66160286352,-137042.73716852602,-123513.8127341885,-109984.88829985097,-96455.963865513462,-82927.039431175945,-69398.114996838442,-55869.190562500924,-42340.266128163414,-28811.341693825903]
[null,null,null,null,{"$f":"'(7) Análise de sensibilidade'!G25","v":384},-164960.54087629641,-151431.6164419589,-137902.69200762134,-124373.76757328385,-110844.84313894634,-97315.918704608834,-83786.994270271331,-70258.069835933828,-56729.14540159631,-43200.2209672588]
[null,null,null,null,{"$f":"'(7) Análise de sensibilidade'!G26","v":432},-179349.42014972933,-165820.49571539179,-152291.57128105423,-138762.64684671676,-125233.72241237925,-111704.79797804174,-98175.873543704249,-84646.949109366687,-71118.024675029184,-57589.100240691681]
[]
[null,null,null,null,"VPL",{"$f":"E28","v":"Custo do Gás Natural"},{"$f":"G28","v":"BRL/m3"}]
[null,null,null,null,{"$f":"'(6) Resultados'!E9","v":-54149.280884310137},{"$f":"'(7) Análise de sensibilidade'!H31","v":0},{"$f":"'(7) Análise de sensibilidade'!I31","v":0.8},{"$f":"'(7) Análise de sensibilidade'!J31","v":1.6},{"$f":"'(7) Análise de sensibilidade'!K31","v":2.4000000000000004},{"$f":"'(7) Análise de sensibilidade'!L31","v":3.2},{"$f":"'(7) Análise de sensibilidade'!M31","v":4},{"$f":"'(7) Análise de sensibilidade'!N31","v":4.8},{"$f":"'(7) Análise de sensibilidade'!O31","v":5.6},{"$f":"'(7) Análise de sensibilidade'!P31","v":6.3999999999999995},{"$f":"'(7) Análise de sensibilidade'!Q31","v":7.1999999999999993}]
[null,null,null,{"$f":"E47","v":"Custo unitário do eletrolisador por unidade de potência instalada"},{"$f":"'(7) Análise de sensibilidade'!G32","v":0},-72267.714484438518,-58738.790050101015,-45209.86561576349,-31680.941181425969,-18152.016747088463,-4623.092312750955,8905.8321215865526,22434.756555924068,35963.680990261579,49492.605424599074]
[null,null,null,{"$f":"G47","v":"BRL/kW"},{"$f":"'(7) Análise de sensibilidade'!G33","v":1200},-82172.952198750354,-68644.027764412866,-55115.103330075333,-41586.178895737816,-28057.254461400298,-14528.330027062791,-999.40559272528299,12529.518841612226,26058.443275949736,39587.367710287261]
[null,null,null,null,{"$f":"'(7) Análise de sensibilidade'!G34","v":2400},-92078.18991306219,-78549.265478724672,-65020.341044387169,-51491.416610049644,-37962.492175712134,-24433.567741374623,-10904.643307037119,2624.2811273003936,16153.205561637904,29682.129995975411]
[null,null,null,null,{"$f":"'(7) Análise de sensibilidade'!G35","v":3600},-101983.42762737404,-88454.503193036508,-74925.578758699005,-61396.65432436148,-47867.729890023977,-34338.805455686466,-20809.881021348956,-7280.9565870114438,6247.9678473260683,19776.892281663575]
[null,null,null,null,{"$f":"'(7) Análise de sensibilidade'!G36","v":4800},-111888.66534168585,-98359.740907348329,-84830.81647301084,-71301.892038673323,-57772.967604335805,-44244.043169998302,-30715.118735660792,-17186.194301323281,-3657.2698669857673,9871.6545673517394]
[null,null,null,null,{"$f":"'(7) Análise de sensibilidade'!G37","v":6000},-121793.9030559977,-108264.97862166018,-94736.054187322676,-81207.129752985158,-67678.205318647641,-54149.280884310137,-40620.356449972627,-27091.432015635117,-13562.507581297603,-33.583146960096201]
[null,null,null,null,{"$f":"'(7) Análise de sensibilidade'!G38","v":7200},-131699.14077030955,-118170.21633597204,-104641.29190163453,-91112.367467296979,-77583.443032959476,-64054.518598621973,-50525.594164284463,-36996.669729946952,-23467.745295609438,-9938.8208612719391]
[null,null,null,null,{"$f":"'(7) Análise de sensibilidade'!G39","v":8400},-141604.37848462135,-128075.45405028386,-114546.52961594635,-101017.60518160884,-87488.680747271326,-73959.756312933809,-60430.831878596298,-46901.907444258788,-33372.983009921278,-19844.058575583771]
[null,null,null,null,{"$f":"'(7) Análise de sensibilidade'!G40","v":9600},-151509.61619893322,-137980.69176459569,-124451.76733025818,-110922.84289592068,-97393.918461583162,-83864.994027245644,-70336.069592908141,-56807.145158570624,-43278.220724233113,-29749.296289895596]
[null,null,null,null,{"$f":"'(7) Análise de sensibilidade'!G41","v":10800},-161414.85391324502,-147885.92947890752,-134357.00504457002,-120828.08061023252,-107299.15617589498,-93770.23174155748,-80241.307307219977,-66712.382872882459,-53183.458438544949,-39654.534004207439]
[]
[null,null,null,null,"VPL",{"$f":"E28","v":"Custo do Gás Natural"},{"$f":"G28","v":"BRL/m3"}]
[null,null,null,null,{"$f":"'(6) Resultados'!E9","v":-54149.280884310137},{"$f":"'(7) Análise de sensibilidade'!H46","v":0},{"$f":"'(7) Análise de sensibilidade'!I46","v":0.8},{"$f":"'(7) Análise de sensibilidade'!J46","v":1.6},{"$f":"'(7) Análise de sensibilidade'!K46","v":2.4000000000000004},{"$f":"'(7) Análise de sensibilidade'!L46","v":3.2},{"$f":"'(7) Análise de sensibilidade'!M46","v":4},{"$f":"'(7) Análise de sensibilidade'!N46","v":4.8},{"$f":"'(7) Análise de sensibilidade'!O46","v":5.6},{"$f":"'(7) Análise de sensibilidade'!P46","v":6.3999999999999995},{"$f":"'(7) Análise de sensibilidade'!Q46","v":7.1999999999999993}]
[null,null,null,{"$f":"E44","v":"Taxa de Desconto"},{"$f":"'(7) Análise de sensibilidade'!G47","v":0},-234074.13097991116,-200485.44032920088,-166896.74967849063,-133308.0590277804,-99719.368377070161,-66130.677726359936,-32541.987075649708,1046.7035750605282,34635.394225770753,68224.084876480978]
[null,null,null,{"$f":"G44","v":"a.a."},{"$f":"'(7) Análise de sensibilidade'!G48","v":0.02},-198965.6394475087,-171757.65927525292,-144549.67910299715,-117341.69893074139,-90133.718758485615,-62925.738586229854,-35717.758413974087,-8509.7782417183153,18698.201930537463,45906.182102793202]
[null,null,null,null,{"$f":"'(7) Análise de sensibilidade'!G49","v":0.04},-172087.20411892334,-149704.68792625362,-127322.17173358385,-104939.65554091404,-82557.139348244295,-60174.623155574533,-37792.106962904771,-15409.590770234998,6972.9254224347678,29355.441615104522]
[null,null,null,null,{"$f":"'(7) Análise de sensibilidade'!G50","v":0.06},-151232.51078710903,-132552.14683032065,-113871.78287353223,-95191.418916743802,-76511.054959955392,-57830.691003166969,-39150.327046378559,-20469.96308959015,-1789.5991328017335,16890.764823986683]
[null,null,null,null,{"$f":"'(7) Análise de sensibilidade'!G51","v":0.08},-134840.46630903648,-119040.34830050601,-103240.2302919756,-87440.112283445196,-71639.994274914774,-55839.876266384366,-40039.758257853944,-24239.640249323529,-8439.5222407931142,7360.5957677373081]
[null,null,null,null,{"$f":"'(7) Análise de sensibilidade'!G52","v":0.1},-121793.9030559977,-108264.97862166018,-94736.054187322676,-81207.129752985158,-67678.205318647641,-54149.280884310137,-40620.356449972627,-27091.432015635117,-13562.507581297603,-33.583146960096201]
[null,null,null,null,{"$f":"'(7) Análise de sensibilidade'!G53","v":0.12000000000000001},-111284.42547042362,-99569.73556383379,-87855.045657243958,-76140.355750654126,-64425.665844064279,-52710.975937474446,-40996.286030884614,-29281.596124294778,-17566.906217704945,-5852.2163111151167]
[null,null,null,null,{"$f":"'(7) Análise de sensibilidade'!G54","v":0.14000000000000001},-102720.69801013124,-92473.21880847172,-82225.739606812189,-71978.260405152658,-61730.781203493141,-51483.302001833617,-41235.822800174101,-30988.343598514577,-20740.864396855053,-10493.385195195529]
[null,null,null,null,{"$f":"'(7) Análise de sensibilidade'!G55","v":0.16},-95665.564658523755,-86618.636082688798,-77571.70750685384,-68524.778931018867,-59477.850355183909,-50430.921779348937,-41383.993203513979,-32337.06462767901,-23290.136051844049,-14243.207476009076]
[null,null,null,null,{"$f":"'(7) Análise de sensibilidade'!G56","v":0.18},-89792.499276930859,-81738.859730476659,-73685.220184022444,-65631.5806375682,-57577.941091114,-49524.301544659778,-41470.661998205564,-33417.022451751342,-25363.382905297127,-17309.743358842908]

{"sheet":"(5) Simulação e Fluxo de Caixa","index":4,"n_rows":68,"n_cols":34,"rows_kept":68,"cut":false,"hidden":false,"merged":[]}
[]
[null,"5. Simulação da produção de H2, fluxos físicos e fluxo de Caixa"]
[]
[]
[null,null,"5.1 Fluxos físicos",null,null,null,0,1,2,3,4,5,6,7,8,9,10,11,12,13,14,15,16,17,18,19,20,null,"Acumulado no tempo de vida",null,null,null,null,"Descrição do campo"]
[]
[null,null,"Rastreamento da substituição da membrana na tencologia PEM",null,null,null,null,null,null,null,null,null,null,null,null,null,null,null,null,null,null,null,null,null,null,null,null,null,null,null,null,null,null,{"$f":"C7","v":"Rastreamento da substituição da membrana na tencologia PEM"}]
[null,null,"Horas de uso do eletrolisador",null,{"$f":"'(4) Entrada de dados'!G36","v":"h"},null,{"$f":"IF(G5>=posterga,Fator_Operacional*TDT,0)","v":0},0,7884,7884,7884,7884,7884,7884,7884,7884,7884,7884,7884,7884,7884,7884,7884,7884,7884,7884,7884,null,{"$f":"SUM(G8:AA8)","v":149796},null,null,null,{"$f":"E8","v":"h"},{"$f":"C8","v":"Horas de uso do eletrolisador"}]
[null,null,"Horas acumuladas",null,{"$f":"'(4) Entrada de dados'!G36","v":"h"},null,{"$f":"G8+F9","v":0},{"$f":"H8+G9","v":0},{"$f":"I8+H9","v":7884},{"$f":"IF(I10,J8,J8+I9)","v":15768},23652,31536,39420,47304,55188,63072,70956,78840,7884,15768,23652,31536,39420,47304,55188,63072,70956,null,{"$f":"SUM(G9:AA9)","v":788400},null,null,null,{"$f":"E9","v":"h"},{"$f":"C9","v":"Horas acumuladas"}]
[null,null,"Troca membrana",null," ",null,{"$f":"IF(G9>=duracao_membrana,TRUE,FALSE)","v":false},false,false,false,false,false,false,false,false,false,false,true,false,false,false,false,false,false,false,false,false,null,"n/a",null,null,null,{"$f":"E10","v":" "},{"$f":"C10","v":"Troca membrana"}]
[]
[]
[null,null,"Produção (fluxos físicos relacionados a Receitas)",null,null,null,null,null,null,null,null,null,null,null,null,null,null,null,null,null,null,null,null,null,null,null,null,null,null,null,null,null,null,{"$f":"C13","v":"Produção (fluxos físicos relacionados a Receitas)"}]
[null,null,"Produção de Hidrogênio",null,"ton",null,{"$f":"IF(G5=posterga,Prod_H2,0)","v":0},{"$f":"IF(H5=posterga,Prod_H2,0)","v":0},{"$f":"IF(OR(I5=posterga,H10),Prod_H2,H14-(Degradacao_aa_EL*H14))","v":708.61391999999989},701.52778079999985,694.5125029919999,687.56737796207995,680.69170418245915,673.88478714063456,667.14593926922817,660.47447987653584,653.86973507777043,647.33103772699269,708.61391999999989,701.52778079999985,694.5125029919999,687.56737796207995,680.69170418245915,673.88478714063456,667.14593926922817,660.47447987653584,653.86973507777043,null,{"$f":"SUM(G14:AA14)","v":12903.907492328408},null,null,null,{"$f":"E14","v":"ton"},{"$f":"C14","v":"Produção de Hidrogênio"}]
[null,null,"Produção de Oxigênio",null,"milhares m3",null,{"$f":"IF(G5=posterga,Prod_O2*Volume.especifico_O2,0)","v":0},{"$f":"IF(H5=posterga,Prod_O2*Volume.especifico_O2,0)","v":0},{"$f":"IF(OR(I5=posterga,H10),Prod_O2*Volume.especifico_O2,H15-(Degradacao_aa_EL*H15))","v":4257.574912523386},4214.9991633981526,4172.8491717641709,4131.1206800465288,4089.8094732460636,4048.9113785136028,4008.4222647284669,3968.3380420811823,3928.6546616603705,3889.3681150437669,4257.574912523386,4214.9991633981526,4172.8491717641709,4131.1206800465288,4089.8094732460636,4048.9113785136028,4008.4222647284669,3968.3380420811823,3928.6546616603705,null,{"$f":"SUM(G15:AA15)","v":77530.727610967631},null,null,null,{"$f":"E15","v":"milhares m3"},{"$f":"C15","v":"Produção de Oxigênio"}]
[]
[]
[null,null,"Cálculo de insumos evitados (fluxos físicos relacionados a Receitas)",null,null,null,null,null,null,null,null,null,null,null,null,null,null,null,null,null,null,null,null,null,null,null,null,null,null,null,null,null,null,{"$f":"C18","v":"Cálculo de insumos evitados (fluxos físicos relacionados a Receitas)"}]
[null,null,{"$f":"\"Consumo corrente de \"&'(4) Entrada de dados'!F14","v":"Consumo corrente de Gás Natural"},null,{"$f":"Unidade_fonte_substituida","v":"m3"},null,{"$f":"IF(G5>=posterga,-Consumo_FonteFossil,0)","v":0},0,-10000000,-10000000,-10000000,-10000000,-10000000,-10000000,-10000000,-10000000,-10000000,-10000000,-10000000,-10000000,-10000000,-10000000,-10000000,-10000000,-10000000,-10000000,-10000000,null,{"$f":"SUM(G19:AA19)","v":-190000000},null,null,null,{"$f":"E19","v":"m3"},{"$f":"C19","v":"Consumo corrente de Gás Natural"}]
[null,null,{"$f":"\"Consumo corrente de \"&'(4) Entrada de dados'!F14","v":"Consumo corrente de Gás Natural"},null,"TJ",null,{"$f":"PCI_fonte_substituida*G19/10^6","v":0},0,-368.43839999999994,-368.43839999999994,-368.43839999999994,-368.43839999999994,-368.43839999999994,-368.43839999999994,-368.43839999999994,-368.43839999999994,-368.43839999999994,-368.43839999999994,-368.43839999999994,-368.43839999999994,-368.43839999999994,-368.43839999999994,-368.43839999999994,-368.43839999999994,-368.43839999999994,-368.43839999999994,-368.43839999999994,null,{"$f":"SUM(G20:AA20)","v":-7000.3295999999991},null,null,null,{"$f":"E20","v":"TJ"},{"$f":"C20","v":"Consumo corrente de Gás Natural"}]
[null,null,{"$f":"\"Consumo de \"&'(4) Entrada de dados'!F14&\" sendo substituído por H2\"","v":"Consumo de Gás Natural sendo substituído por H2"},null,"TJ",null,{"$f":"G14*PCI_H2/10^3","v":0},0,84.948636729599983,84.099150362303973,83.258158858680943,82.425577270094124,81.601321497393187,80.785308282419251,79.977455199595056,79.177680647599104,78.385903841123096,77.602044802711873,84.948636729599983,84.099150362303973,83.258158858680943,82.425577270094124,81.601321497393187,80.785308282419251,79.977455199595056,79.177680647599104,78.385903841123096,null,{"$f":"SUM(G21:AA21)","v":1546.9204301803295},null,null,null,{"$f":"E21","v":"TJ"},"Energia que a produção total de H2 proporciona em substituição ao gás natural"]
[null,null,{"$f":"\"Consumo de \"&'(4) Entrada de dados'!F14&\" sendo substituído por H2\"","v":"Consumo de Gás Natural sendo substituído por H2"},null,{"$f":"Unidade_fonte_substituida","v":"m3"},null,{"$f":"G21/(PCI_fonte_substituida/10^6)","v":0},0,2305640.1485187211,2282583.7470335336,2259757.9095631987,2237160.3304675664,2214788.7271628911,2192640.8398912619,2170714.4314923491,2149007.2871774258,2127517.2143056509,2106242.0421625949,2305640.1485187211,2282583.7470335336,2259757.9095631987,2237160.3304675664,2214788.7271628911,2192640.8398912619,2170714.4314923491,2149007.2871774258,2127517.2143056509,null,{"$f":"SUM(G22:AA22)","v":41985863.313387796},null,null,null,{"$f":"E22","v":"m3"},"Consumo de Gás Natural sendo substituído por H2"]
[null,null,{"$f":" \"Percentual de substituição de \"&'(4) Entrada de dados'!F14&\" por H2 (base energética)\"","v":"Percentual de substituição de Gás Natural por H2 (base energética)"},null,"%",null,{"$f":"IFERROR(G22/ABS(G19),\"\")","v":""},{"$f":"IFERROR(H22/ABS(H19),\"\")","v":""},{"$f":"IFERROR(I22/ABS(I19),\"\")","v":0.23056401485187211},{"$f":"IFERROR(J22/ABS(J19),\"\")","v":0.22825837470335336},0.22597579095631987,0.22371603304675663,0.2214788727162891,0.2192640839891262,0.21707144314923491,0.21490072871774257,0.21275172143056509,0.21062420421625949,0.23056401485187211,0.22825837470335336,0.22597579095631987,0.22371603304675663,0.2214788727162891,0.2192640839891262,0.21707144314923491,0.21490072871774257,0.21275172143056509,null,{"$f":"IFERROR(AC22/ABS(AC19),\"\")","v":0.22097822796519892},null,null,null,"%",{"$f":"\"Esse resultado demonstra a perfomance do projeto frente ao objetivo de se substituir \"&'(4) Entrada de dados'!F20*100&\"% (em base energética) da fonte fóssil por H2\"","v":"Esse resultado demonstra a perfomance do projeto frente ao objetivo de se substituir 50% (em base energética) da fonte fóssil por H2"}]
[null,null,"Consumo efetivo de Gás Natural na aplicação final utilizando H2",null,{"$f":"Unidade_fonte_substituida","v":"m3"},null,{"$f":"G19+G22","v":0},{"$f":"H19+H22","v":0},{"$f":"I19+I22","v":-7694359.8514812794},-7717416.2529664664,-7740242.0904368013,{"$f":"L19+L22","v":-7762839.6695324332},-7785211.2728371089,-7807359.1601087376,-7829285.5685076509,-7850992.7128225742,-7872482.7856943496,-7893757.9578374047,-7694359.8514812794,-7717416.2529664664,-7740242.0904368013,-7762839.6695324332,-7785211.2728371089,-7807359.1601087376,-7829285.5685076509,-7850992.7128225742,-7872482.7856943496,null,{"$f":"SUM(G24:AA24)","v":-148014136.68661219},null,null,null,"m3","Consumo efetivo de Gás Natural na aplicação final utilizando H2"]
[null,null,"Consumo efetivo de Gás Natural na aplicação final utilizando H2",null,"TJ",null,{"$f":"G24*PCI_fonte_substituida/10^6","v":0},0,-283.48976327039998,-284.33924963769596,-285.18024114131896,{"$f":"L24*PCI_fonte_substituida/10^6","v":-286.01282272990579},-286.83707850260674,-287.65309171758065,-288.46094480040483,-289.26071935240083,-290.05249615887686,-290.83635519728801,-283.48976327039998,-284.33924963769596,-285.18024114131896,-286.01282272990579,-286.83707850260674,-287.65309171758065,-288.46094480040483,-289.26071935240083,-290.05249615887686,null,{"$f":"SUM(G25:AA25)","v":-5453.4091698196689},null,null,null,"TJ","Consumo efetivo de Gás Natural na aplicação final utilizando H2"]
[]
[]
[null,null,"Mitigação de emissões (fluxos físicios relacionados a Receitas)",null,null,null,null,null,null,null,null,null,null,null,null,null,null,null,null,null,null,null,null,null,null,null,null,null,null,null,null,null,null,{"$f":"C28","v":"Mitigação de emissões (fluxos físicios relacionados a Receitas)"}]
[null,null,"Emissão de CO2eq evitada no processo utilizando H2",null,"ton",null,{"$f":"(-G20+G25)*fator_emissao_fonte_substituida","v":0},0,{"$f":"(-I20+I25)*fator_emissao_fonte_substituida - (I14*PCI_H2/10^3)*CO2_H2","v":6528.3027326697575},6463.0197053430611,6398.3895082896333,6334.4056132067353,6271.0615570746668,6208.3509415039225,6146.2674320888837,6084.8047577679918,6023.9567101903085,5963.7171430884118,6528.3027326697575,6463.0197053430611,6398.3895082896333,6334.4056132067353,6271.0615570746668,6208.3509415039225,6146.2674320888837,6084.8047577679918,6023.9567101903085,null,{"$f":"SUM(G29:AA29)","v":118880.83505935833},null,null,null,{"$f":"E29","v":"ton"},{"$f":"C29","v":"Emissão de CO2eq evitada no processo utilizando H2"}]
[]
[]
[null,null,"Insumos utilizados (fluxos físicos relacionados a Custos)",null,null,null,null,null,null,null,null,null,null,null,null,null,null,null,null,null,null,null,null,null,null,null,null,null,null,null,null,null,null,{"$f":"C32","v":"Insumos utilizados (fluxos físicos relacionados a Custos)"}]
[null,null,"Consumo de energia elétrica para a eletrólise",null,"MWh",null,{"$f":"IF(G5>=posterga,Consumo_de_energia_eletrica__MWh_ano,0)","v":0},0,-39420,-39420,-39420,-39420,-39420,-39420,-39420,-39420,-39420,-39420,-39420,-39420,-39420,-39420,-39420,-39420,-39420,-39420,-39420,null,{"$f":"SUM(G33:AA33)","v":-748980},null,null,null,{"$f":"E33","v":"MWh"},{"$f":"C33","v":"Consumo de energia elétrica para a eletrólise"}]
[null,null,"Consumo de água para a eletrólise",null,"m3",null,{"$f":"IF(G5>=posterga,Cons_Agua,0)","v":0},0,-7086.1392000000005,-7086.1392000000005,-7086.1392000000005,-7086.1392000000005,-7086.1392000000005,-7086.1392000000005,-7086.1392000000005,-7086.1392000000005,-7086.1392000000005,-7086.1392000000005,-7086.1392000000005,-7086.1392000000005,-7086.1392000000005,-7086.1392000000005,-7086.1392000000005,-7086.1392000000005,-7086.1392000000005,-7086.1392000000005,-7086.1392000000005,null,{"$f":"SUM(G34:AA34)","v":-134636.64480000004},null,null,null,{"$f":"E34","v":"m3"},{"$f":"C34","v":"Consumo de água para a eletrólise"}]
[]
[]
[]
[]
[null,null,"5.2 Fluxo de caixa do projeto de substituição",null,null,null,0,1,2,3,4,5,6,7,8,9,10,11,12,13,14,15,16,17,18,19,20,null,"Acumulado no tempo de vida",null,null,null,null,"Descrição do campo"]
[]
[null,null,{"$f":"\"Receitas (milhares de \"&Moeda&\" )\"","v":"Receitas (milhares de BRL )"},null,null,null,null,null,null,null,null,null,null,null,null,null,null,null,null,null,null,null,null,null,null,null,null,null,null,null,null,null,null,{"$f":"C41","v":"Receitas (milhares de BRL )"}]
[null,null,{"$f":"\"Consumo evitado de \"&'(4) Entrada de dados'!F14","v":"Consumo evitado de Gás Natural"},null,null,null,{"$f":"(G22)*custo_fonte_substituida/10^3","v":0},0,9222.5605940748846,9130.3349881341346,9039.0316382527944,8948.6413218702655,8859.1549086515643,8770.563359565047,8682.8577259693957,8596.0291487097038,8510.0688572226045,8424.9681686503791,9222.5605940748846,9130.3349881341346,9039.0316382527944,8948.6413218702655,8859.1549086515643,8770.563359565047,8682.8577259693957,8596.0291487097038,8510.0688572226045,null,{"$f":"SUM(G42:AB42)","v":167943.45325355115},null,null,null,null,"Consumo evitado de Gás Natural"]
[null,null,"Oxigênio",null,null,null,{"$f":"G15*preco_do_oxigenio_por_m3","v":0},0,0,0,0,0,0,0,0,0,0,0,0,0,0,0,0,0,0,0,0,null,{"$f":"SUM(G43:AB43)","v":0},null,null,null,null,"Oxigênio"]
[null,null,"Créditos de Carbono",null,null,null,{"$f":"preco_credito_carbono_eq*(G29)/1000","v":0},0,{"$f":"preco_credito_carbono_eq*(I29)/1000","v":0},0,0,0,0,0,0,0,0,0,0,0,0,0,0,0,0,0,0,null,{"$f":"SUM(G44:AB44)","v":0},null,null,null,null,"Créditos de Carbono"]
[null,null,"Valor residual do eletrolisador",null,null,null,null,null,null,null,null,null,null,null,null,null,null,null,null,null,null,null,null,null,null,null,{"$f":"valor_residual_ultimo_ano_EL/1000","v":8888.8888888888887},null,{"$f":"SUM(G45:AB45)","v":8888.8888888888887},null,null,null,null,"Valor residual do eletrolisador"]
[]
[null,null,{"$f":"\"Receita anual total (milhares de \"&Moeda&\" )\"","v":"Receita anual total (milhares de BRL )"},null,null,null,{"$f":"SUM(G42:G46)","v":0},0,9222.5605940748846,9130.3349881341346,9039.0316382527944,8948.6413218702655,8859.1549086515643,8770.563359565047,8682.8577259693957,8596.0291487097038,8510.0688572226045,8424.9681686503791,9222.5605940748846,9130.3349881341346,9039.0316382527944,8948.6413218702655,8859.1549086515643,8770.563359565047,8682.8577259693957,8596.0291487097038,17398.957746111493,null,{"$f":"SUM(AC42:AC46)","v":176832.34214244003},null,null,null,null,{"$f":"C47","v":"Receita anual total (milhares de BRL )"}]
[]
[null,null,{"$f":"\"Custos (milhares de \"&Moeda&\" )\"","v":"Custos (milhares de BRL )"},null,null,null,null,null,null,null,null,null,null,null,null,null,null,null,null,null,null,null,null,null,null,null,null,null,null,null,null,null,null,{"$f":"C49","v":"Custos (milhares de BRL )"}]
[null,null,"Energia elétrica adquirida para uso no EL",null,null,null,{"$f":"(G33)*custo_da_energia_eletrica_por_MWh/1000","v":0},0,-9460.7999999999993,-9460.7999999999993,-9460.7999999999993,-9460.7999999999993,-9460.7999999999993,-9460.7999999999993,-9460.7999999999993,-9460.7999999999993,-9460.7999999999993,-9460.7999999999993,-9460.7999999999993,-9460.7999999999993,-9460.7999999999993,-9460.7999999999993,-9460.7999999999993,-9460.7999999999993,-9460.7999999999993,-9460.7999999999993,-9460.7999999999993,null,{"$f":"SUM(G50:AB50)","v":-179755.19999999995},null,null,null,null,{"$f":"C50","v":"Energia elétrica adquirida para uso no EL"}]
[null,null,"Água EL",null,null,null,{"$f":"G34*custo_da_agua_por_m3/1000","v":0},0,-42.516835200000003,-42.516835200000003,-42.516835200000003,-42.516835200000003,-42.516835200000003,-42.516835200000003,-42.516835200000003,-42.516835200000003,-42.516835200000003,-42.516835200000003,-42.516835200000003,-42.516835200000003,-42.516835200000003,-42.516835200000003,-42.516835200000003,-42.516835200000003,-42.516835200000003,-42.516835200000003,-42.516835200000003,null,{"$f":"SUM(G51:AB51)","v":-807.81986880000045},null,null,null,null,{"$f":"C51","v":"Água EL"}]
[null,null,"Operação e Manutenção EL",null,null,null,{"$f":"IF(G5>=posterga,custos_OeM_EL/1000,0)","v":0},0,-300,-300,-300,-300,-300,-300,-300,-300,-300,-300,-300,-300,-300,-300,-300,-300,-300,-300,-300,null,{"$f":"SUM(G52:AB52)","v":-5700},null,null,null,null,"Operação e Manutenção EL"]
[null,null,"Troca de Membrana EL",null,null,null,0,0,{"$f":"IF(I10,custo_troca_membrana/1000,0)","v":0},0,0,0,0,0,0,0,0,-6000,0,0,0,0,0,0,0,0,0,null,{"$f":"SUM(G53:AB53)","v":-6000},null,null,null,null,"Troca de Membrana EL"]
[null,null,"Outros custos EL",null,null,null,{"$f":"IF(G5>=posterga,custos_outros_opex_EL/1000,0)","v":0},0,-300,-300,-300,-300,-300,-300,-300,-300,-300,-300,-300,-300,-300,-300,-300,-300,-300,-300,-300,null,{"$f":"SUM(G54:AB54)","v":-5700},null,null,null,null,"Outros custos EL"]
[null,null,"Demais custos",null,null,null,{"$f":"IF(G5>=posterga,'(4) Entrada de dados'!$L$62/1000,0)","v":0},{"$f":"IF(H5>=posterga,'(4) Entrada de dados'!$L$62/1000,0)","v":0},{"$f":"IF(I5>=posterga,'(4) Entrada de dados'!$L$62/1000,0)","v":0},{"$f":"IF(J5>=posterga,'(4) Entrada de dados'!$L$62/1000,0)","v":0},{"$f":"IF(K5>=posterga,'(4) Entrada de dados'!$L$62/1000,0)","v":0},{"$f":"IF(L5>=posterga,'(4) Entrada de dados'!$L$62/1000,0)","v":0},{"$f":"IF(M5>=posterga,'(4) Entrada de dados'!$L$62/1000,0)","v":0},{"$f":"IF(N5>=posterga,'(4) Entrada de dados'!$L$62/1000,0)","v":0},{"$f":"IF(O5>=posterga,'(4) Entrada de dados'!$L$62/1000,0)","v":0},{"$f":"IF(P5>=posterga,'(4) Entrada de dados'!$L$62/1000,0)","v":0},{"$f":"IF(Q5>=posterga,'(4) Entrada de dados'!$L$62/1000,0)","v":0},{"$f":"IF(R5>=posterga,'(4) Entrada de dados'!$L$62/1000,0)","v":0},{"$f":"IF(S5>=posterga,'(4) Entrada de dados'!$L$62/1000,0)","v":0},{"$f":"IF(T5>=posterga,'(4) Entrada de dados'!$L$62/1000,0)","v":0},{"$f":"IF(U5>=posterga,'(4) Entrada de dados'!$L$62/1000,0)","v":0},{"$f":"IF(V5>=posterga,'(4) Entrada de dados'!$L$62/1000,0)","v":0},{"$f":"IF(W5>=posterga,'(4) Entrada de dados'!$L$62/1000,0)","v":0},{"$f":"IF(X5>=posterga,'(4) Entrada de dados'!$L$62/1000,0)","v":0},{"$f":"IF(Y5>=posterga,'(4) Entrada de dados'!$L$62/1000,0)","v":0},{"$f":"IF(Z5>=posterga,'(4) Entrada de dados'!$L$62/1000,0)","v":0},{"$f":"IF(AA5>=posterga,'(4) Entrada de dados'!$L$62/1000,0)","v":0},null,null,null,null,null,null,"Demais custos"]
[]
[null,null,{"$f":"\"Custo anual total (milhares de \"&Moeda&\" )\"","v":"Custo anual total (milhares de BRL )"},null,null,null,{"$f":"SUM(G50:G56)","v":0},{"$f":"SUM(H50:H56)","v":0},{"$f":"SUM(I50:I56)","v":-10103.316835199999},{"$f":"SUM(J50:J56)","v":-10103.316835199999},-10103.316835199999,-10103.316835199999,-10103.316835199999,-10103.316835199999,-10103.316835199999,-10103.316835199999,-10103.316835199999,-16103.316835199999,-10103.316835199999,-10103.316835199999,-10103.316835199999,-10103.316835199999,-10103.316835199999,-10103.316835199999,-10103.316835199999,-10103.316835199999,-10103.316835199999,null,{"$f":"SUM(AC50:AC56)","v":-197963.01986879995},null,null,null,null,{"$f":"C57","v":"Custo anual total (milhares de BRL )"}]
[]
[null,null,{"$f":"\"Investimento (milhares de \"&Moeda&\" )\"","v":"Investimento (milhares de BRL )"},null,null,null,null,null,null,null,null,null,null,null,null,null,null,null,null,null,null,null,null,null,null,null,null,null,null,null,null,null,null,{"$f":"\"Investimento (milhares de \"&Moeda&\" )\"","v":"Investimento (milhares de BRL )"}]
[null,null,"Alocação do Investimento",null,"%",null,{"$f":"'(4) Entrada de dados'!F37","v":0.8},{"$f":"'(4) Entrada de dados'!F38","v":0.2},{"$f":"'(4) Entrada de dados'!F39","v":0},{"$f":"'(4) Entrada de dados'!F40","v":0},{"$f":"'(4) Entrada de dados'!F41","v":0},null,null,null,null,null,null,null,null,null,null,null,null,null,null,null,null,null,{"$f":"SUM(G60:AB60)","v":1},null,null,null,null,{"$f":"C60","v":"Alocação do Investimento"}]
[null,null,"CAPEX relacionado ao eletrolisador",null,null,true,{"$f":"IF($F$61,CAPEX_EL/10^3*G60,0)","v":-36000},{"$f":"IF($F$61,CAPEX_EL/10^3*H60,0)","v":-9000},{"$f":"IF($F$61,CAPEX_EL/10^3*I60,0)","v":0},{"$f":"IF($F$61,CAPEX_EL/10^3*J60,0)","v":0},{"$f":"IF($F$61,CAPEX_EL/10^3*K60,0)","v":0},null,null,null,null,null,null,null,null,null,null,null,null,null,null,null,null,null,{"$f":"SUM(G61:AB61)","v":-45000},null,null,null,null,{"$f":"C61","v":"CAPEX relacionado ao eletrolisador"}]
[]
[]
[null,null,{"$f":"\"Investimento total (milhares de \"&Moeda&\" )\"","v":"Investimento total (milhares de BRL )"},null,{"$f":"Moeda","v":"BRL"},null,{"$f":"SUM(G61)","v":-36000},{"$f":"SUM(H61)","v":-9000},{"$f":"SUM(I61)","v":0},{"$f":"SUM(J61)","v":0},{"$f":"SUM(K61)","v":0},null,null,null,null,null,null,null,null,null,null,null,null,null,null,null,null,null,{"$f":"SUM(G64:AB64)","v":-45000},null,null,null,null,{"$f":"C64","v":"Investimento total (milhares de BRL )"}]
[]
[null,null,{"$f":"\"Fluxo de Caixa (milhares de \"&Moeda&\" )\"","v":"Fluxo de Caixa (milhares de BRL )"},null,null,null,null,null,null,null,null,null,null,null,null,null,null,null,null,null,null,null,null,null,null,null,null,null,null,null,null,null,null,{"$f":"\"Fluxo de Caixa (milhares de \"&Moeda&\" )\"","v":"Fluxo de Caixa (milhares de BRL )"}]
[null,null,"Fluxos de Caixa",null,null,null,{"$f":"G47+G57+G64","v":-36000},-9000,-880.75624112511468,-972.98184706586471,-1064.2851969472049,-1154.6755133297338,-1244.1619265484351,-1332.7534756349523,-1420.4591092306036,-1507.2876864902955,-1593.2479779773948,-7678.3486665496202,-880.75624112511468,-972.98184706586471,-1064.2851969472049,-1154.6755133297338,-1244.1619265484351,-1332.7534756349523,-1420.4591092306036,-1507.2876864902955,7295.6409109114938,null,{"$f":"AC47+AC57+AC61","v":-66130.677726359922},null,null,null,null,{"$f":"C67","v":"Fluxos de Caixa"}]
[null,null,"Fluxo de Caixa Acumulado",null,null,null,{"$f":"+G67","v":-36000},{"$f":"+G68+H67","v":-45000},{"$f":"+H68+I67","v":-45880.756241125113},{"$f":"+I68+J67","v":-46853.738088190978},{"$f":"+J68+K67","v":-47918.023285138181},-49072.698798467914,-50316.860725016348,{"$f":"+M68+N67","v":-51649.614200651296},-53070.073309881904,-54577.360996372197,-56170.60897434959,-63848.957640899214,-64729.713882024327,-65702.695729090192,-66766.980926037402,-67921.656439367129,-69165.818365915562,-70498.571841550511,-71919.030950781118,-73426.318637271412,-66130.677726359922,null,null,null,null,{"$f":"AC67-AC68","v":-66130.677726359922},null,{"$f":"C68","v":"Fluxo de Caixa Acumulado"}]

{"sheet":"(6) Resultados","index":5,"n_rows":104,"n_cols":32,"rows_kept":104,"cut":false,"hidden":false,"merged":[[8,8,20,10],[8,4,20,6],[26,4,38,6],[44,4,56,6],[44,8,56,10],[30,8,30,10],[31,8,32,10],[36,8,36,10],[37,8,39,10]]}
[]
[null,"6. Resultados",null,null,null,null,null,null,null,null,null,null,null,null,null,null,null,null,null,null,null,null,null,null,null,null,null,null,null,null,null,{"$f":"SUM(AF3:AF1048576)","v":{"$error":"#REF!"}}]
[]
[]
[null,null,"Relatório",null,"CAPEX eletrolisador",null,null,null,null,null,null,null,"Project Cash Flows",null,{"$f":"C85","v":"Fluxos de Caixa"},null,{"$f":"C104","v":"Fluxo de Caixa Acumulado"}]
[]
[null,null,null,null,"Valor Presente Líquido (milhares BRL)",null,null,null,"Período de Payback Simples"]
[null,null,null,null,"VPL do projeto de substituição",null,null,null,"Payback do projeto de substituição"]
[null,null,null,null,{"$f":"G87","v":-54149.280884310137},null,null,null,{"$f":"AC100","v":20}]
[]
[]
[]
[]
[]
[null,null,null,null,null,null,null,null,null,null,null,null,null,null,null,null,null,null,null,null,null,null,null,null,null,null,null,null,null,null,null,{"$f":"#REF!-AC85","v":{"$error":"#REF!"}}]
[]
[]
[]
[]
[]
[]
[]
[]
[]
[null,null,null,null,"Taxa Interna de Retorno (% a.a.)",null,null,null,"Composição de valores no LCOH (BRL/kg)"]
[null,null,null,null,"TIR do projeto de substituição",null,null,null,"Custo nivelado do H2 produzido"]
[null,null,null,null,{"$f":"G88","v":{"$error":"#NUM!"}},null,null,null,"Investimento eletrolisador",null,{"$f":"-NPV(TxDesconto,G81:AA81)/NPV(TxDesconto,'(5) Simulação e Fluxo de Caixa'!G14:AA14)","v":8.5006502248023175}]
[null,null,null,null,null,null,null,null,"O&M e membrana",null,{"$f":"-(NPV(TxDesconto,'(5) Simulação e Fluxo de Caixa'!G52:AA52)+NPV(TxDesconto,'(5) Simulação e Fluxo de Caixa'!G53:AA53)+NPV(TxDesconto,'(5) Simulação e Fluxo de Caixa'!G54:AA54) + NPV(TxDesconto,'(5) Simulação e Fluxo de Caixa'!G55:AA55))/NPV(TxDesconto,'(5) Simulação e Fluxo de Caixa'!G14:AA14)","v":1.2824808192328059}]
[null,null,null,null,null,null,null,null,"Água",null,{"$f":"-NPV(TxDesconto,'(5) Simulação e Fluxo de Caixa'!G51:AA51)/NPV(TxDesconto,'(5) Simulação e Fluxo de Caixa'!G14:AA14)","v":6.220690635631744E-2}]
[null,null,null,null,null,null,null,null,"Eletricidade",null,{"$f":"-NPV(TxDesconto,'(5) Simulação e Fluxo de Caixa'!G50:AA50)/NPV(TxDesconto,'(5) Simulação e Fluxo de Caixa'!G14:AA14)","v":13.842213252407079}]
[null,null,null,null,null,null,null,null,"LCOH (BRL/kg)"]
[null,null,null,null,null,null,null,null,{"$f":"SUM(K27:K30)","v":23.68755120279852}]
[]
[null,null,null,null,null,null,null,null,"Receita de O2",null,{"$f":"NPV(TxDesconto,G94:AA94)/NPV(TxDesconto,'(5) Simulação e Fluxo de Caixa'!G14:AA14)","v":0}]
[null,null,null,null,null,null,null,null,"Receita de CO2",null,{"$f":"NPV(TxDesconto,G93:AA93)/NPV(TxDesconto,'(5) Simulação e Fluxo de Caixa'!G14:AA14)","v":0}]
[null,null,null,null,null,null,null,null,"Receita de valor residual",null,{"$f":"NPV(TxDesconto,G95:AA95)/NPV(TxDesconto,'(5) Simulação e Fluxo de Caixa'!G14:AA14)","v":0.2542156815686793}]
[null,null,null,null,null,null,null,null,"LCOH final(BRL/kg)"]
[null,null,null,null,null,null,null,null,{"$f":"I32-K34-K35-K36","v":23.433335521229839}]
[]
[null,null,null,null,{"$f":"IFERROR(IF(E27>0,\"\",\"Projeto inviável em qualquer cenário\"),\"Erro no cálculo da TIR - Projeto inviável\")","v":"Erro no cálculo da TIR - Projeto inviável"}]
[]
[]
[null,null,null,null,"Emissões Evitadas (tonCO2eq/ano)",null,null,null,{"$f":"\"Custo de competitividade da fonte fóssil (\"&Moeda&\"/\"&Unidade_fonte_substituida&\")\"","v":"Custo de competitividade da fonte fóssil (BRL/m3)"}]
[null,null,null,null,"Média anual das emissões evitadas",null,null,null,"Preço da fonte fóssil, abaixo do qual o H2 é promissor"]
[null,null,null,null,{"$f":"IFERROR(AVERAGEIF('(5) Simulação e Fluxo de Caixa'!F29:AA29,\">0\",'(5) Simulação e Fluxo de Caixa'!F29:AA29),0)+IFERROR(AVERAGEIF('(5) Simulação e Fluxo de Caixa'!#REF!,\">0\",'(5) Simulação e Fluxo de Caixa'!#REF!),0)","v":6256.8860557557018},null,null,null,{"$f":"G98","v":7.2019858576118478}]
[]
[]
[]
[]
[]
[]
[]
[]
[]
[]
[]
[]
[]
[]
[]
[]
[null,null,"Fluxo de caixa previsto",null,null,null,0,1,2,3,4,5,6,7,8,9,10,11,12,13,14,15,16,17,18,19,20,null,"Lifetime"]
[]
[null,null,"Receitas"]
[null,null,"Energia Evitada",null,null,null,null,null,null,null,null,null,null,null,null,null,null,null,null,null,null,null,null,null,null,null,null,null,{"$f":"SUM(G65:AB65)","v":0}]
[null,null,"Hidrogênio"]
[null,null,"Outros",null,null,null,null,null,null,null,null,null,null,null,null,null,null,null,null,null,null,null,null,null,null,null,null,null,{"$f":"SUM(G67:AB67)","v":0}]
[]
[null,null,{"$f":"C64","v":"Receitas"},null,{"$f":"Moeda","v":"BRL"},null,null,{"$f":"'(5) Simulação e Fluxo de Caixa'!H47","v":0},{"$f":"'(5) Simulação e Fluxo de Caixa'!I47","v":9222.5605940748846},{"$f":"'(5) Simulação e Fluxo de Caixa'!J47","v":9130.3349881341346},{"$f":"'(5) Simulação e Fluxo de Caixa'!K47","v":9039.0316382527944},{"$f":"'(5) Simulação e Fluxo de Caixa'!L47","v":8948.6413218702655},{"$f":"'(5) Simulação e Fluxo de Caixa'!M47","v":8859.1549086515643},{"$f":"'(5) Simulação e Fluxo de Caixa'!N47","v":8770.563359565047},{"$f":"'(5) Simulação e Fluxo de Caixa'!O47","v":8682.8577259693957},{"$f":"'(5) Simulação e Fluxo de Caixa'!P47","v":8596.0291487097038},{"$f":"'(5) Simulação e Fluxo de Caixa'!Q47","v":8510.0688572226045},{"$f":"'(5) Simulação e Fluxo de Caixa'!R47","v":8424.9681686503791},{"$f":"'(5) Simulação e Fluxo de Caixa'!S47","v":9222.5605940748846},{"$f":"'(5) Simulação e Fluxo de Caixa'!T47","v":9130.3349881341346},{"$f":"'(5) Simulação e Fluxo de Caixa'!U47","v":9039.0316382527944},{"$f":"'(5) Simulação e Fluxo de Caixa'!V47","v":8948.6413218702655},{"$f":"'(5) Simulação e Fluxo de Caixa'!W47","v":8859.1549086515643},{"$f":"'(5) Simulação e Fluxo de Caixa'!X47","v":8770.563359565047},{"$f":"'(5) Simulação e Fluxo de Caixa'!Y47","v":8682.8577259693957},{"$f":"'(5) Simulação e Fluxo de Caixa'!Z47","v":8596.0291487097038},{"$f":"'(5) Simulação e Fluxo de Caixa'!AA47","v":17398.957746111493},null,{"$f":"SUM(AC65:AC68)","v":0}]
[]
[null,null,{"$f":"'(5) Simulação e Fluxo de Caixa'!C49","v":"Custos (milhares de BRL )"}]
[null,null,"Eletrolisador",null,{"$f":"Moeda","v":"BRL"},null,{"$f":"SUM('(5) Simulação e Fluxo de Caixa'!G50:G55)","v":0},{"$f":"SUM('(5) Simulação e Fluxo de Caixa'!H50:H55)","v":0},{"$f":"SUM('(5) Simulação e Fluxo de Caixa'!I50:I55)","v":-10103.316835199999},{"$f":"SUM('(5) Simulação e Fluxo de Caixa'!J50:J55)","v":-10103.316835199999},{"$f":"SUM('(5) Simulação e Fluxo de Caixa'!K50:K55)","v":-10103.316835199999},{"$f":"SUM('(5) Simulação e Fluxo de Caixa'!L50:L55)","v":-10103.316835199999},{"$f":"SUM('(5) Simulação e Fluxo de Caixa'!M50:M55)","v":-10103.316835199999},{"$f":"SUM('(5) Simulação e Fluxo de Caixa'!N50:N55)","v":-10103.316835199999},{"$f":"SUM('(5) Simulação e Fluxo de Caixa'!O50:O55)","v":-10103.316835199999},{"$f":"SUM('(5) Simulação e Fluxo de Caixa'!P50:P55)","v":-10103.316835199999},{"$f":"SUM('(5) Simulação e Fluxo de Caixa'!Q50:Q55)","v":-10103.316835199999},{"$f":"SUM('(5) Simulação e Fluxo de Caixa'!R50:R55)","v":-16103.316835199999},{"$f":"SUM('(5) Simulação e Fluxo de Caixa'!S50:S55)","v":-10103.316835199999},{"$f":"SUM('(5) Simulação e Fluxo de Caixa'!T50:T55)","v":-10103.316835199999},{"$f":"SUM('(5) Simulação e Fluxo de Caixa'!U50:U55)","v":-10103.316835199999},{"$f":"SUM('(5) Simulação e Fluxo de Caixa'!V50:V55)","v":-10103.316835199999},{"$f":"SUM('(5) Simulação e Fluxo de Caixa'!W50:W55)","v":-10103.316835199999},{"$f":"SUM('(5) Simulação e Fluxo de Caixa'!X50:X55)","v":-10103.316835199999},{"$f":"SUM('(5) Simulação e Fluxo de Caixa'!Y50:Y55)","v":-10103.316835199999},{"$f":"SUM('(5) Simulação e Fluxo de Caixa'!Z50:Z55)","v":-10103.316835199999},{"$f":"SUM('(5) Simulação e Fluxo de Caixa'!AA50:AA55)","v":-10103.316835199999},null,{"$f":"SUM(G72:AB72)","v":-197963.01986880007}]
[]
[null,null,{"$f":"C71","v":"Custos (milhares de BRL )"},null,{"$f":"Moeda","v":"BRL"},null,{"$f":"SUM(G72:G72)","v":0},0,-10103.316835199999,-10103.316835199999,-10103.316835199999,-10103.316835199999,-10103.316835199999,-10103.316835199999,-10103.316835199999,-10103.316835199999,-10103.316835199999,-16103.316835199999,-10103.316835199999,-10103.316835199999,-10103.316835199999,-10103.316835199999,-10103.316835199999,-10103.316835199999,-10103.316835199999,-10103.316835199999,-10103.316835199999,null,{"$f":"-SUM(AC72:AC73)","v":197963.01986880007}]
[]
[null,null,"Investimento"]
[null,null,"Alocação de Investimentos",null,"%",null,{"$f":"'(5) Simulação e Fluxo de Caixa'!G60","v":0.8},{"$f":"'(5) Simulação e Fluxo de Caixa'!H60","v":0.2},{"$f":"'(5) Simulação e Fluxo de Caixa'!I60","v":0},{"$f":"'(5) Simulação e Fluxo de Caixa'!J60","v":0},{"$f":"'(5) Simulação e Fluxo de Caixa'!K60","v":0},{"$f":"'(5) Simulação e Fluxo de Caixa'!L60","v":0},null,null,null,null,null,null,null,null,null,null,null,null,null,null,null,null,{"$f":"SUM(G77:AB77)","v":1},null,null,{"$f":"(1-AC77)*1000","v":0}]
[]
[]
[]
[null,null,{"$f":"C76","v":"Investimento"},null,{"$f":"Moeda","v":"BRL"},null,{"$f":"'(5) Simulação e Fluxo de Caixa'!G64","v":-36000},{"$f":"'(5) Simulação e Fluxo de Caixa'!H64","v":-9000},{"$f":"'(5) Simulação e Fluxo de Caixa'!I64","v":0},{"$f":"'(5) Simulação e Fluxo de Caixa'!J64","v":0},{"$f":"'(5) Simulação e Fluxo de Caixa'!K64","v":0},{"$f":"'(5) Simulação e Fluxo de Caixa'!L64","v":0},null,null,null,null,null,null,null,null,null,null,null,null,null,null,null,null,{"$f":"SUM(G81:AB81)","v":-45000}]
[]
[]
[null,null,"Fluxos de Caixa"]
[null,null,"Fluxos de Caixa",null,{"$f":"Moeda","v":"BRL"},null,{"$f":"G69+G74+G81","v":-36000},-9000,-880.75624112511468,-972.98184706586471,-1064.2851969472049,-1154.6755133297338,-1244.1619265484351,-1332.7534756349523,-1420.4591092306036,-1507.2876864902955,-1593.2479779773948,-7678.3486665496202,-880.75624112511468,-972.98184706586471,-1064.2851969472049,-1154.6755133297338,-1244.1619265484351,-1332.7534756349523,-1420.4591092306036,-1507.2876864902955,7295.6409109114938,null,{"$f":"AC69+AC74+AC81","v":152963.01986880007}]
[null,null,"Fluxo de Caixa Acumulado",null,{"$f":"Moeda","v":"BRL"},null,{"$f":"+G85","v":-36000},{"$f":"+G86+H85","v":-45000},-45880.756241125113,-46853.738088190978,-47918.023285138181,-49072.698798467914,-50316.860725016348,-51649.614200651296,-53070.073309881904,-54577.360996372197,-56170.60897434959,-63848.957640899214,-64729.713882024327,-65702.695729090192,-66766.980926037402,-67921.656439367129,-69165.818365915562,-70498.571841550511,-71919.030950781118,-73426.318637271412,-66130.677726359922,null,{"$f":"AA86","v":-66130.677726359922},null,null,{"$f":"AC85-AC86","v":219093.69759515999}]
[null,null,"Valor presente dos fluxos de caixa",null,{"$f":"Moeda","v":"BRL"},null,{"$f":"NPV(TxDesconto,H85:AA85)+G85","v":-54149.280884310137}]
[null,null,"TIR (taxa interna de retorno)",null,"%",null,{"$f":"IRR(G85:AA85)","v":{"$error":"#NUM!"}}]
[null,null,"TIRM (TIR modificada)",null,"%",null,{"$f":"MIRR(G85:AA85,TxDesconto,TxDesconto)","v":-9.6261147623175947E-2}]
[]
[null,null,"Cálculo do LCOH"]
[null,null,"Custos associados ao H2",null,{"$f":"Moeda","v":"BRL"},null,{"$f":"'(5) Simulação e Fluxo de Caixa'!G57+'(5) Simulação e Fluxo de Caixa'!G64","v":-36000},{"$f":"'(5) Simulação e Fluxo de Caixa'!H57+'(5) Simulação e Fluxo de Caixa'!H64","v":-9000},{"$f":"'(5) Simulação e Fluxo de Caixa'!I57+'(5) Simulação e Fluxo de Caixa'!I64","v":-10103.316835199999},{"$f":"'(5) Simulação e Fluxo de Caixa'!J57+'(5) Simulação e Fluxo de Caixa'!J64","v":-10103.316835199999},{"$f":"'(5) Simulação e Fluxo de Caixa'!K57+'(5) Simulação e Fluxo de Caixa'!K64","v":-10103.316835199999},{"$f":"'(5) Simulação e Fluxo de Caixa'!L57+'(5) Simulação e Fluxo de Caixa'!L64","v":-10103.316835199999},{"$f":"'(5) Simulação e Fluxo de Caixa'!M57+'(5) Simulação e Fluxo de Caixa'!M64","v":-10103.316835199999},{"$f":"'(5) Simulação e Fluxo de Caixa'!N57+'(5) Simulação e Fluxo de Caixa'!N64","v":-10103.316835199999},{"$f":"'(5) Simulação e Fluxo de Caixa'!O57+'(5) Simulação e Fluxo de Caixa'!O64","v":-10103.316835199999},{"$f":"'(5) Simulação e Fluxo de Caixa'!P57+'(5) Simulação e Fluxo de Caixa'!P64","v":-10103.316835199999},{"$f":"'(5) Simulação e Fluxo de Caixa'!Q57+'(5) Simulação e Fluxo de Caixa'!Q64","v":-10103.316835199999},{"$f":"'(5) Simulação e Fluxo de Caixa'!R57+'(5) Simulação e Fluxo de Caixa'!R64","v":-16103.316835199999},{"$f":"'(5) Simulação e Fluxo de Caixa'!S57+'(5) Simulação e Fluxo de Caixa'!S64","v":-10103.316835199999},{"$f":"'(5) Simulação e Fluxo de Caixa'!T57+'(5) Simulação e Fluxo de Caixa'!T64","v":-10103.316835199999},{"$f":"'(5) Simulação e Fluxo de Caixa'!U57+'(5) Simulação e Fluxo de Caixa'!U64","v":-10103.316835199999},{"$f":"'(5) Simulação e Fluxo de Caixa'!V57+'(5) Simulação e Fluxo de Caixa'!V64","v":-10103.316835199999},{"$f":"'(5) Simulação e Fluxo de Caixa'!W57+'(5) Simulação e Fluxo de Caixa'!W64","v":-10103.316835199999},{"$f":"'(5) Simulação e Fluxo de Caixa'!X57+'(5) Simulação e Fluxo de Caixa'!X64","v":-10103.316835199999},{"$f":"'(5) Simulação e Fluxo de Caixa'!Y57+'(5) Simulação e Fluxo de Caixa'!Y64","v":-10103.316835199999},{"$f":"'(5) Simulação e Fluxo de Caixa'!Z57+'(5) Simulação e Fluxo de Caixa'!Z64","v":-10103.316835199999},{"$f":"'(5) Simulação e Fluxo de Caixa'!AA57+'(5) Simulação e Fluxo de Caixa'!AA64","v":-10103.316835199999}]
[null,null,"Receita do crédito de CO2",null,{"$f":"Moeda","v":"BRL"},null,{"$f":"'(5) Simulação e Fluxo de Caixa'!G44","v":0},{"$f":"'(5) Simulação e Fluxo de Caixa'!H44","v":0},{"$f":"'(5) Simulação e Fluxo de Caixa'!I44","v":0},{"$f":"'(5) Simulação e Fluxo de Caixa'!J44","v":0},{"$f":"'(5) Simulação e Fluxo de Caixa'!K44","v":0},{"$f":"'(5) Simulação e Fluxo de Caixa'!L44","v":0},{"$f":"'(5) Simulação e Fluxo de Caixa'!M44","v":0},{"$f":"'(5) Simulação e Fluxo de Caixa'!N44","v":0},{"$f":"'(5) Simulação e Fluxo de Caixa'!O44","v":0},{"$f":"'(5) Simulação e Fluxo de Caixa'!P44","v":0},{"$f":"'(5) Simulação e Fluxo de Caixa'!Q44","v":0},{"$f":"'(5) Simulação e Fluxo de Caixa'!R44","v":0},{"$f":"'(5) Simulação e Fluxo de Caixa'!S44","v":0},{"$f":"'(5) Simulação e Fluxo de Caixa'!T44","v":0},{"$f":"'(5) Simulação e Fluxo de Caixa'!U44","v":0},{"$f":"'(5) Simulação e Fluxo de Caixa'!V44","v":0},{"$f":"'(5) Simulação e Fluxo de Caixa'!W44","v":0},{"$f":"'(5) Simulação e Fluxo de Caixa'!X44","v":0},{"$f":"'(5) Simulação e Fluxo de Caixa'!Y44","v":0},{"$f":"'(5) Simulação e Fluxo de Caixa'!Z44","v":0},{"$f":"'(5) Simulação e Fluxo de Caixa'!AA44","v":0}]
[null,null,"Receita do aproveitamento do O2",null,"BRL",null,{"$f":"'(5) Simulação e Fluxo de Caixa'!G43","v":0},{"$f":"'(5) Simulação e Fluxo de Caixa'!H43","v":0},{"$f":"'(5) Simulação e Fluxo de Caixa'!I43","v":0},{"$f":"'(5) Simulação e Fluxo de Caixa'!J43","v":0},{"$f":"'(5) Simulação e Fluxo de Caixa'!K43","v":0},{"$f":"'(5) Simulação e Fluxo de Caixa'!L43","v":0},{"$f":"'(5) Simulação e Fluxo de Caixa'!M43","v":0},{"$f":"'(5) Simulação e Fluxo de Caixa'!N43","v":0},{"$f":"'(5) Simulação e Fluxo de Caixa'!O43","v":0},{"$f":"'(5) Simulação e Fluxo de Caixa'!P43","v":0},{"$f":"'(5) Simulação e Fluxo de Caixa'!Q43","v":0},{"$f":"'(5) Simulação e Fluxo de Caixa'!R43","v":0},{"$f":"'(5) Simulação e Fluxo de Caixa'!S43","v":0},{"$f":"'(5) Simulação e Fluxo de Caixa'!T43","v":0},{"$f":"'(5) Simulação e Fluxo de Caixa'!U43","v":0},{"$f":"'(5) Simulação e Fluxo de Caixa'!V43","v":0},{"$f":"'(5) Simulação e Fluxo de Caixa'!W43","v":0},{"$f":"'(5) Simulação e Fluxo de Caixa'!X43","v":0},{"$f":"'(5) Simulação e Fluxo de Caixa'!Y43","v":0},{"$f":"'(5) Simulação e Fluxo de Caixa'!Z43","v":0},{"$f":"'(5) Simulação e Fluxo de Caixa'!AA43","v":0}]
[null,null,"Receita de valores residuais",null,"BRL",null,{"$f":"'(5) Simulação e Fluxo de Caixa'!G45","v":0},{"$f":"'(5) Simulação e Fluxo de Caixa'!H45","v":0},{"$f":"'(5) Simulação e Fluxo de Caixa'!I45","v":0},{"$f":"'(5) Simulação e Fluxo de Caixa'!J45","v":0},{"$f":"'(5) Simulação e Fluxo de Caixa'!K45","v":0},{"$f":"'(5) Simulação e Fluxo de Caixa'!L45","v":0},{"$f":"'(5) Simulação e Fluxo de Caixa'!M45","v":0},{"$f":"'(5) Simulação e Fluxo de Caixa'!N45","v":0},{"$f":"'(5) Simulação e Fluxo de Caixa'!O45","v":0},{"$f":"'(5) Simulação e Fluxo de Caixa'!P45","v":0},{"$f":"'(5) Simulação e Fluxo de Caixa'!Q45","v":0},{"$f":"'(5) Simulação e Fluxo de Caixa'!R45","v":0},{"$f":"'(5) Simulação e Fluxo de Caixa'!S45","v":0},{"$f":"'(5) Simulação e Fluxo de Caixa'!T45","v":0},{"$f":"'(5) Simulação e Fluxo de Caixa'!U45","v":0},{"$f":"'(5) Simulação e Fluxo de Caixa'!V45","v":0},{"$f":"'(5) Simulação e Fluxo de Caixa'!W45","v":0},{"$f":"'(5) Simulação e Fluxo de Caixa'!X45","v":0},{"$f":"'(5) Simulação e Fluxo de Caixa'!Y45","v":0},{"$f":"'(5) Simulação e Fluxo de Caixa'!Z45","v":0},{"$f":"'(5) Simulação e Fluxo de Caixa'!AA45","v":8888.8888888888887}]
[null,null,"LCOH",null,"BRL/kg",null,{"$f":"-NPV(TxDesconto,G92:AA92)/NPV(TxDesconto,'(5) Simulação e Fluxo de Caixa'!G14:AA14)","v":23.68755120279852}]
[null,null,"LCOH considerando receitas",null,"BRL/kg",null,{"$f":"-(NPV(TxDesconto,G92:AA92)+NPV(TxDesconto,G93:AA93)+NPV(TxDesconto,G94:AA94)+NPV(TxDesconto,G95:AA95))/NPV(TxDesconto,'(5) Simulação e Fluxo de Caixa'!G14:AA14)","v":23.433335521229843}]
[null,null,"Preço break-even da fonte fóssil",null,{"$f":"Moeda&\"/\"&Unidade_fonte_substituida","v":"BRL/m3"},null,{"$f":"-(NPV(TxDesconto,G92:AA92)+NPV(TxDesconto,G93:AA93)+NPV(TxDesconto,G94:AA94)+NPV(TxDesconto,G95:AA95))/NPV(TxDesconto,'(5) Simulação e Fluxo de Caixa'!G22:AA22)*10^3","v":7.2019858576118478}]
[null,null,"Payback Period"]
[null,null,"Cálculo de payback",null,"Anos",null,null,{"$f":"IF(AND(H86>0,G86<0),-G86/H85+G100,IF(H86<0,G100+1,G100))","v":1},2,3,4,5,6,7,8,9,10,11,12,13,14,15,16,17,18,19,20,null,{"$f":"AA100","v":20}]
[]
[null,null,"Gráfico"]
[null,null,{"$f":"C85","v":"Fluxos de Caixa"},null,true,null,{"$f":"IF($E103,G85,\"\")","v":-36000},{"$f":"IF($E103,H85,\"\")","v":-9000},{"$f":"IF($E103,I85,\"\")","v":-880.75624112511468},{"$f":"IF($E103,J85,\"\")","v":-972.98184706586471},-1064.2851969472049,-1154.6755133297338,-1244.1619265484351,-1332.7534756349523,-1420.4591092306036,-1507.2876864902955,-1593.2479779773948,-7678.3486665496202,-880.75624112511468,-972.98184706586471,-1064.2851969472049,-1154.6755133297338,-1244.1619265484351,-1332.7534756349523,-1420.4591092306036,-1507.2876864902955,7295.6409109114938]
[null,null,{"$f":"C86","v":"Fluxo de Caixa Acumulado"},null,true,null,{"$f":"IF($E104,G86,\"\")","v":-36000},-45000,-45880.756241125113,-46853.738088190978,-47918.023285138181,-49072.698798467914,-50316.860725016348,-51649.614200651296,-53070.073309881904,-54577.360996372197,-56170.60897434959,-63848.957640899214,-64729.713882024327,-65702.695729090192,-66766.980926037402,-67921.656439367129,-69165.818365915562,-70498.571841550511,-71919.030950781118,-73426.318637271412,-66130.677726359922]

{"sheet":"(7) Análise de sensibilidade","index":6,"n_rows":56,"n_cols":33,"rows_kept":56,"cut":false,"hidden":false,"merged":[]}
[]
[null,null,null,"7. Análise de Sensibilidade",null,null,null,null,null,null,null,null,null,null,null,null,null,null,null,null,null,null,null,null,null,null,null,null,null,null,null,null,{"$f":"SUM(AG3:AG1048576)","v":0}]
[]
[]
[null,null,null,"Análise de sensibilidade aplicadas sobre o VPL do projeto de substituição"]
[]
[]
[]
[]
[]
[]
[]
[null,null,null,"7.1 Variação do VPL mantendo-se os parâmetros constantes, exceto: o custo da energia elétrica e o custo da fonte fóssil"]
[]
[null,null,null,null,null,null,{"$f":"'(4) Entrada de dados'!E85","v":"VPL"},{"$f":"'(4) Entrada de dados'!F85","v":"Custo do Gás Natural"},{"$f":"'(4) Entrada de dados'!G85","v":"BRL/m3"}]
[null,null,null,null,null,null,{"$f":"'(4) Entrada de dados'!E86","v":-54149.280884310137},0,0.8,1.6,2.4000000000000004,3.2,4,4.8,5.6,6.3999999999999995,7.1999999999999993]
[null,null,null,null,null,{"$f":"'(4) Entrada de dados'!D87","v":"Custo da energia elétrica"},0,{"$f":"'(4) Entrada de dados'!F87","v":-49849.506688833222},{"$f":"'(4) Entrada de dados'!G87","v":-36320.582254495705},{"$f":"'(4) Entrada de dados'!H87","v":-22791.657820158194},{"$f":"'(4) Entrada de dados'!I87","v":-9262.7333858206803},{"$f":"'(4) Entrada de dados'!J87","v":4266.191048516841},{"$f":"'(4) Entrada de dados'!K87","v":17795.115482854344},{"$f":"'(4) Entrada de dados'!L87","v":31324.039917191869},{"$f":"'(4) Entrada de dados'!M87","v":44852.964351529372},{"$f":"'(4) Entrada de dados'!N87","v":58381.88878586689},{"$f":"'(4) Entrada de dados'!O87","v":71910.813220204393}]
[null,null,null,null,null,{"$f":"'(4) Entrada de dados'!D88","v":"BRL/MWh"},48,{"$f":"'(4) Entrada de dados'!F88","v":-64238.385962266111},{"$f":"'(4) Entrada de dados'!G88","v":-50709.461527928601},{"$f":"'(4) Entrada de dados'!H88","v":-37180.537093591091},{"$f":"'(4) Entrada de dados'!I88","v":-23651.612659253573},{"$f":"'(4) Entrada de dados'!J88","v":-10122.688224916059},{"$f":"'(4) Entrada de dados'!K88","v":3406.2362094214477},{"$f":"'(4) Entrada de dados'!L88","v":16935.160643758958},{"$f":"'(4) Entrada de dados'!M88","v":30464.085078096468},{"$f":"'(4) Entrada de dados'!N88","v":43993.009512433986},{"$f":"'(4) Entrada de dados'!O88","v":57521.933946771504}]
[null,null,null,null,null,null,96,{"$f":"'(4) Entrada de dados'!F89","v":-78627.265235699015},{"$f":"'(4) Entrada de dados'!G89","v":-65098.340801361497},{"$f":"'(4) Entrada de dados'!H89","v":-51569.41636702398},{"$f":"'(4) Entrada de dados'!I89","v":-38040.491932686469},{"$f":"'(4) Entrada de dados'!J89","v":-24511.567498348959},{"$f":"'(4) Entrada de dados'!K89","v":-10982.643064011449},{"$f":"'(4) Entrada de dados'!L89","v":2546.281370326069},{"$f":"'(4) Entrada de dados'!M89","v":16075.205804663572},{"$f":"'(4) Entrada de dados'!N89","v":29604.130239001097},{"$f":"'(4) Entrada de dados'!O89","v":43133.054673338585}]
[null,null,null,null,null,null,144,{"$f":"'(4) Entrada de dados'!F90","v":-93016.144509131904},{"$f":"'(4) Entrada de dados'!G90","v":-79487.220074794401},{"$f":"'(4) Entrada de dados'!H90","v":-65958.295640456883},{"$f":"'(4) Entrada de dados'!I90","v":-52429.37120611938},{"$f":"'(4) Entrada de dados'!J90","v":-38900.446771781855},{"$f":"'(4) Entrada de dados'!K90","v":-25371.522337444345},{"$f":"'(4) Entrada de dados'!L90","v":-11842.597903106838},{"$f":"'(4) Entrada de dados'!M90","v":1686.3265312306758},{"$f":"'(4) Entrada de dados'!N90","v":15215.250965568186},{"$f":"'(4) Entrada de dados'!O90","v":28744.175399905704}]
[null,null,null,null,null,null,192,{"$f":"'(4) Entrada de dados'!F91","v":-107405.02378256482},{"$f":"'(4) Entrada de dados'!G91","v":-93876.09934822729},{"$f":"'(4) Entrada de dados'!H91","v":-80347.174913889772},{"$f":"'(4) Entrada de dados'!I91","v":-66818.250479552284},{"$f":"'(4) Entrada de dados'!J91","v":-53289.326045214752},{"$f":"'(4) Entrada de dados'!K91","v":-39760.401610877241},{"$f":"'(4) Entrada de dados'!L91","v":-26231.477176539731},{"$f":"'(4) Entrada de dados'!M91","v":-12702.552742202221},{"$f":"'(4) Entrada de dados'!N91","v":826.3716921352825},{"$f":"'(4) Entrada de dados'!O91","v":14355.2961264728}]
[null,null,null,null,null,null,240,{"$f":"'(4) Entrada de dados'!F92","v":-121793.9030559977},{"$f":"'(4) Entrada de dados'!G92","v":-108264.97862166018},{"$f":"'(4) Entrada de dados'!H92","v":-94736.054187322676},{"$f":"'(4) Entrada de dados'!I92","v":-81207.129752985158},{"$f":"'(4) Entrada de dados'!J92","v":-67678.205318647641},{"$f":"'(4) Entrada de dados'!K92","v":-54149.280884310137},{"$f":"'(4) Entrada de dados'!L92","v":-40620.356449972627},{"$f":"'(4) Entrada de dados'!M92","v":-27091.432015635117},{"$f":"'(4) Entrada de dados'!N92","v":-13562.507581297603},{"$f":"'(4) Entrada de dados'!O92","v":-33.583146960096201}]
[null,null,null,null,null,null,288,{"$f":"'(4) Entrada de dados'!F93","v":-136182.78232943063},{"$f":"'(4) Entrada de dados'!G93","v":-122653.85789509307},{"$f":"'(4) Entrada de dados'!H93","v":-109124.93346075558},{"$f":"'(4) Entrada de dados'!I93","v":-95596.009026418033},{"$f":"'(4) Entrada de dados'!J93","v":-82067.084592080559},{"$f":"'(4) Entrada de dados'!K93","v":-68538.160157743041},{"$f":"'(4) Entrada de dados'!L93","v":-55009.235723405523},{"$f":"'(4) Entrada de dados'!M93","v":-41480.311289068013},{"$f":"'(4) Entrada de dados'!N93","v":-27951.386854730503},{"$f":"'(4) Entrada de dados'!O93","v":-14422.462420392989}]
[null,null,null,null,null,null,336,{"$f":"'(4) Entrada de dados'!F94","v":-150571.66160286352},{"$f":"'(4) Entrada de dados'!G94","v":-137042.73716852602},{"$f":"'(4) Entrada de dados'!H94","v":-123513.8127341885},{"$f":"'(4) Entrada de dados'!I94","v":-109984.88829985097},{"$f":"'(4) Entrada de dados'!J94","v":-96455.963865513462},{"$f":"'(4) Entrada de dados'!K94","v":-82927.039431175945},{"$f":"'(4) Entrada de dados'!L94","v":-69398.114996838442},{"$f":"'(4) Entrada de dados'!M94","v":-55869.190562500924},{"$f":"'(4) Entrada de dados'!N94","v":-42340.266128163414},{"$f":"'(4) Entrada de dados'!O94","v":-28811.341693825903}]
[null,null,null,null,null,null,384,{"$f":"'(4) Entrada de dados'!F95","v":-164960.54087629641},{"$f":"'(4) Entrada de dados'!G95","v":-151431.6164419589},{"$f":"'(4) Entrada de dados'!H95","v":-137902.69200762134},{"$f":"'(4) Entrada de dados'!I95","v":-124373.76757328385},{"$f":"'(4) Entrada de dados'!J95","v":-110844.84313894634},{"$f":"'(4) Entrada de dados'!K95","v":-97315.918704608834},{"$f":"'(4) Entrada de dados'!L95","v":-83786.994270271331},{"$f":"'(4) Entrada de dados'!M95","v":-70258.069835933828},{"$f":"'(4) Entrada de dados'!N95","v":-56729.14540159631},{"$f":"'(4) Entrada de dados'!O95","v":-43200.2209672588}]
[null,null,null,null,null,null,432,{"$f":"'(4) Entrada de dados'!F96","v":-179349.42014972933},{"$f":"'(4) Entrada de dados'!G96","v":-165820.49571539179},{"$f":"'(4) Entrada de dados'!H96","v":-152291.57128105423},{"$f":"'(4) Entrada de dados'!I96","v":-138762.64684671676},{"$f":"'(4) Entrada de dados'!J96","v":-125233.72241237925},{"$f":"'(4) Entrada de dados'!K96","v":-111704.79797804174},{"$f":"'(4) Entrada de dados'!L96","v":-98175.873543704249},{"$f":"'(4) Entrada de dados'!M96","v":-84646.949109366687},{"$f":"'(4) Entrada de dados'!N96","v":-71118.024675029184},{"$f":"'(4) Entrada de dados'!O96","v":-57589.100240691681}]
[]
[null,null,null,"7.2 Variação do VPL mantendo-se os parâmetros constantes, exceto: o custo unitário do eletrolisador e o custo da fonte fóssil"]
[]
[null,null,null,null,null,null,{"$f":"'(4) Entrada de dados'!E85","v":"VPL"},{"$f":"'(4) Entrada de dados'!F85","v":"Custo do Gás Natural"},{"$f":"'(4) Entrada de dados'!G85","v":"BRL/m3"}]
[null,null,null,null,null,null,{"$f":"'(4) Entrada de dados'!E99","v":-54149.280884310137},0,0.8,1.6,2.4000000000000004,3.2,4,4.8,5.6,6.3999999999999995,7.1999999999999993]
[null,null,null,null,null,{"$f":"'(4) Entrada de dados'!D100","v":"Custo unitário do eletrolisador por unidade de potência instalada"},0,{"$f":"'(4) Entrada de dados'!F100","v":-72267.714484438518},{"$f":"'(4) Entrada de dados'!G100","v":-58738.790050101015},{"$f":"'(4) Entrada de dados'!H100","v":-45209.86561576349},{"$f":"'(4) Entrada de dados'!I100","v":-31680.941181425969},{"$f":"'(4) Entrada de dados'!J100","v":-18152.016747088463},{"$f":"'(4) Entrada de dados'!K100","v":-4623.092312750955},{"$f":"'(4) Entrada de dados'!L100","v":8905.8321215865526},{"$f":"'(4) Entrada de dados'!M100","v":22434.756555924068},{"$f":"'(4) Entrada de dados'!N100","v":35963.680990261579},{"$f":"'(4) Entrada de dados'!O100","v":49492.605424599074}]
[null,null,null,null,null,{"$f":"'(4) Entrada de dados'!D101","v":"BRL/kW"},1200,{"$f":"'(4) Entrada de dados'!F101","v":-82172.952198750354},{"$f":"'(4) Entrada de dados'!G101","v":-68644.027764412866},{"$f":"'(4) Entrada de dados'!H101","v":-55115.103330075333},{"$f":"'(4) Entrada de dados'!I101","v":-41586.178895737816},{"$f":"'(4) Entrada de dados'!J101","v":-28057.254461400298},{"$f":"'(4) Entrada de dados'!K101","v":-14528.330027062791},{"$f":"'(4) Entrada de dados'!L101","v":-999.40559272528299},{"$f":"'(4) Entrada de dados'!M101","v":12529.518841612226},{"$f":"'(4) Entrada de dados'!N101","v":26058.443275949736},{"$f":"'(4) Entrada de dados'!O101","v":39587.367710287261}]
[null,null,null,null,null,null,2400,{"$f":"'(4) Entrada de dados'!F102","v":-92078.18991306219},{"$f":"'(4) Entrada de dados'!G102","v":-78549.265478724672},{"$f":"'(4) Entrada de dados'!H102","v":-65020.341044387169},{"$f":"'(4) Entrada de dados'!I102","v":-51491.416610049644},{"$f":"'(4) Entrada de dados'!J102","v":-37962.492175712134},{"$f":"'(4) Entrada de dados'!K102","v":-24433.567741374623},{"$f":"'(4) Entrada de dados'!L102","v":-10904.643307037119},{"$f":"'(4) Entrada de dados'!M102","v":2624.2811273003936},{"$f":"'(4) Entrada de dados'!N102","v":16153.205561637904},{"$f":"'(4) Entrada de dados'!O102","v":29682.129995975411}]
[null,null,null,null,null,null,3600,{"$f":"'(4) Entrada de dados'!F103","v":-101983.42762737404},{"$f":"'(4) Entrada de dados'!G103","v":-88454.503193036508},{"$f":"'(4) Entrada de dados'!H103","v":-74925.578758699005},{"$f":"'(4) Entrada de dados'!I103","v":-61396.65432436148},{"$f":"'(4) Entrada de dados'!J103","v":-47867.729890023977},{"$f":"'(4) Entrada de dados'!K103","v":-34338.805455686466},{"$f":"'(4) Entrada de dados'!L103","v":-20809.881021348956},{"$f":"'(4) Entrada de dados'!M103","v":-7280.9565870114438},{"$f":"'(4) Entrada de dados'!N103","v":6247.9678473260683},{"$f":"'(4) Entrada de dados'!O103","v":19776.892281663575}]
[null,null,null,null,null,null,4800,{"$f":"'(4) Entrada de dados'!F104","v":-111888.66534168585},{"$f":"'(4) Entrada de dados'!G104","v":-98359.740907348329},{"$f":"'(4) Entrada de dados'!H104","v":-84830.81647301084},{"$f":"'(4) Entrada de dados'!I104","v":-71301.892038673323},{"$f":"'(4) Entrada de dados'!J104","v":-57772.967604335805},{"$f":"'(4) Entrada de dados'!K104","v":-44244.043169998302},{"$f":"'(4) Entrada de dados'!L104","v":-30715.118735660792},{"$f":"'(4) Entrada de dados'!M104","v":-17186.194301323281},{"$f":"'(4) Entrada de dados'!N104","v":-3657.2698669857673},{"$f":"'(4) Entrada de dados'!O104","v":9871.6545673517394}]
[null,null,null,null,null,null,6000,{"$f":"'(4) Entrada de dados'!F105","v":-121793.9030559977},{"$f":"'(4) Entrada de dados'!G105","v":-108264.97862166018},{"$f":"'(4) Entrada de dados'!H105","v":-94736.054187322676},{"$f":"'(4) Entrada de dados'!I105","v":-81207.129752985158},{"$f":"'(4) Entrada de dados'!J105","v":-67678.205318647641},{"$f":"'(4) Entrada de dados'!K105","v":-54149.280884310137},{"$f":"'(4) Entrada de dados'!L105","v":-40620.356449972627},{"$f":"'(4) Entrada de dados'!M105","v":-27091.432015635117},{"$f":"'(4) Entrada de dados'!N105","v":-13562.507581297603},{"$f":"'(4) Entrada de dados'!O105","v":-33.583146960096201}]
[null,null,null,null,null,null,7200,{"$f":"'(4) Entrada de dados'!F106","v":-131699.14077030955},{"$f":"'(4) Entrada de dados'!G106","v":-118170.21633597204},{"$f":"'(4) Entrada de dados'!H106","v":-104641.29190163453},{"$f":"'(4) Entrada de dados'!I106","v":-91112.367467296979},{"$f":"'(4) Entrada de dados'!J106","v":-77583.443032959476},{"$f":"'(4) Entrada de dados'!K106","v":-64054.518598621973},{"$f":"'(4) Entrada de dados'!L106","v":-50525.594164284463},{"$f":"'(4) Entrada de dados'!M106","v":-36996.669729946952},{"$f":"'(4) Entrada de dados'!N106","v":-23467.745295609438},{"$f":"'(4) Entrada de dados'!O106","v":-9938.8208612719391}]
[null,null,null,null,null,null,8400,{"$f":"'(4) Entrada de dados'!F107","v":-141604.37848462135},{"$f":"'(4) Entrada de dados'!G107","v":-128075.45405028386},{"$f":"'(4) Entrada de dados'!H107","v":-114546.52961594635},{"$f":"'(4) Entrada de dados'!I107","v":-101017.60518160884},{"$f":"'(4) Entrada de dados'!J107","v":-87488.680747271326},{"$f":"'(4) Entrada de dados'!K107","v":-73959.756312933809},{"$f":"'(4) Entrada de dados'!L107","v":-60430.831878596298},{"$f":"'(4) Entrada de dados'!M107","v":-46901.907444258788},{"$f":"'(4) Entrada de dados'!N107","v":-33372.983009921278},{"$f":"'(4) Entrada de dados'!O107","v":-19844.058575583771}]
[null,null,null,null,null,null,9600,{"$f":"'(4) Entrada de dados'!F108","v":-151509.61619893322},{"$f":"'(4) Entrada de dados'!G108","v":-137980.69176459569},{"$f":"'(4) Entrada de dados'!H108","v":-124451.76733025818},{"$f":"'(4) Entrada de dados'!I108","v":-110922.84289592068},{"$f":"'(4) Entrada de dados'!J108","v":-97393.918461583162},{"$f":"'(4) Entrada de dados'!K108","v":-83864.994027245644},{"$f":"'(4) Entrada de dados'!L108","v":-70336.069592908141},{"$f":"'(4) Entrada de dados'!M108","v":-56807.145158570624},{"$f":"'(4) Entrada de dados'!N108","v":-43278.220724233113},{"$f":"'(4) Entrada de dados'!O108","v":-29749.296289895596}]
[null,null,null,null,null,null,10800,{"$f":"'(4) Entrada de dados'!F109","v":-161414.85391324502},{"$f":"'(4) Entrada de dados'!G109","v":-147885.92947890752},{"$f":"'(4) Entrada de dados'!H109","v":-134357.00504457002},{"$f":"'(4) Entrada de dados'!I109","v":-120828.08061023252},{"$f":"'(4) Entrada de dados'!J109","v":-107299.15617589498},{"$f":"'(4) Entrada de dados'!K109","v":-93770.23174155748},{"$f":"'(4) Entrada de dados'!L109","v":-80241.307307219977},{"$f":"'(4) Entrada de dados'!M109","v":-66712.382872882459},{"$f":"'(4) Entrada de dados'!N109","v":-53183.458438544949},{"$f":"'(4) Entrada de dados'!O109","v":-39654.534004207439}]
[]
[null,null,null,"7.3 Variação do VPL mantendo-se os parâmetros constantes, exceto: o custo da energia elétrica e o custo da fonte fóssil"]
[]
[null,null,null,null,null,null,{"$f":"'(4) Entrada de dados'!E85","v":"VPL"},{"$f":"'(4) Entrada de dados'!F85","v":"Custo do Gás Natural"},{"$f":"'(4) Entrada de dados'!G85","v":"BRL/m3"}]
[null,null,null,null,null,null,{"$f":"'(4) Entrada de dados'!E112","v":-54149.280884310137},0,0.8,1.6,2.4000000000000004,3.2,4,4.8,5.6,6.3999999999999995,7.1999999999999993]
[null,null,null,null,null,{"$f":"'(4) Entrada de dados'!D113","v":"Taxa de Desconto"},0,{"$f":"'(4) Entrada de dados'!F113","v":-234074.13097991116},{"$f":"'(4) Entrada de dados'!G113","v":-200485.44032920088},{"$f":"'(4) Entrada de dados'!H113","v":-166896.74967849063},{"$f":"'(4) Entrada de dados'!I113","v":-133308.0590277804},{"$f":"'(4) Entrada de dados'!J113","v":-99719.368377070161},{"$f":"'(4) Entrada de dados'!K113","v":-66130.677726359936},{"$f":"'(4) Entrada de dados'!L113","v":-32541.987075649708},{"$f":"'(4) Entrada de dados'!M113","v":1046.7035750605282},{"$f":"'(4) Entrada de dados'!N113","v":34635.394225770753},{"$f":"'(4) Entrada de dados'!O113","v":68224.084876480978}]
[null,null,null,null,null,{"$f":"'(4) Entrada de dados'!D114","v":"a.a."},0.02,{"$f":"'(4) Entrada de dados'!F114","v":-198965.6394475087},{"$f":"'(4) Entrada de dados'!G114","v":-171757.65927525292},{"$f":"'(4) Entrada de dados'!H114","v":-144549.67910299715},{"$f":"'(4) Entrada de dados'!I114","v":-117341.69893074139},{"$f":"'(4) Entrada de dados'!J114","v":-90133.718758485615},{"$f":"'(4) Entrada de dados'!K114","v":-62925.738586229854},{"$f":"'(4) Entrada de dados'!L114","v":-35717.758413974087},{"$f":"'(4) Entrada de dados'!M114","v":-8509.7782417183153},{"$f":"'(4) Entrada de dados'!N114","v":18698.201930537463},{"$f":"'(4) Entrada de dados'!O114","v":45906.182102793202}]
[null,null,null,null,null,null,0.04,{"$f":"'(4) Entrada de dados'!F115","v":-172087.20411892334},{"$f":"'(4) Entrada de dados'!G115","v":-149704.68792625362},{"$f":"'(4) Entrada de dados'!H115","v":-127322.17173358385},{"$f":"'(4) Entrada de dados'!I115","v":-104939.65554091404},{"$f":"'(4) Entrada de dados'!J115","v":-82557.139348244295},{"$f":"'(4) Entrada de dados'!K115","v":-60174.623155574533},{"$f":"'(4) Entrada de dados'!L115","v":-37792.106962904771},{"$f":"'(4) Entrada de dados'!M115","v":-15409.590770234998},{"$f":"'(4) Entrada de dados'!N115","v":6972.9254224347678},{"$f":"'(4) Entrada de dados'!O115","v":29355.441615104522}]
[null,null,null,null,null,null,0.06,{"$f":"'(4) Entrada de dados'!F116","v":-151232.51078710903},{"$f":"'(4) Entrada de dados'!G116","v":-132552.14683032065},{"$f":"'(4) Entrada de dados'!H116","v":-113871.78287353223},{"$f":"'(4) Entrada de dados'!I116","v":-95191.418916743802},{"$f":"'(4) Entrada de dados'!J116","v":-76511.054959955392},{"$f":"'(4) Entrada de dados'!K116","v":-57830.691003166969},{"$f":"'(4) Entrada de dados'!L116","v":-39150.327046378559},{"$f":"'(4) Entrada de dados'!M116","v":-20469.96308959015},{"$f":"'(4) Entrada de dados'!N116","v":-1789.5991328017335},{"$f":"'(4) Entrada de dados'!O116","v":16890.764823986683}]
[null,null,null,null,null,null,0.08,{"$f":"'(4) Entrada de dados'!F117","v":-134840.46630903648},{"$f":"'(4) Entrada de dados'!G117","v":-119040.34830050601},{"$f":"'(4) Entrada de dados'!H117","v":-103240.2302919756},{"$f":"'(4) Entrada de dados'!I117","v":-87440.112283445196},{"$f":"'(4) Entrada de dados'!J117","v":-71639.994274914774},{"$f":"'(4) Entrada de dados'!K117","v":-55839.876266384366},{"$f":"'(4) Entrada de dados'!L117","v":-40039.758257853944},{"$f":"'(4) Entrada de dados'!M117","v":-24239.640249323529},{"$f":"'(4) Entrada de dados'!N117","v":-8439.5222407931142},{"$f":"'(4) Entrada de dados'!O117","v":7360.5957677373081}]
[null,null,null,null,null,null,0.1,{"$f":"'(4) Entrada de dados'!F118","v":-121793.9030559977},{"$f":"'(4) Entrada de dados'!G118","v":-108264.97862166018},{"$f":"'(4) Entrada de dados'!H118","v":-94736.054187322676},{"$f":"'(4) Entrada de dados'!I118","v":-81207.129752985158},{"$f":"'(4) Entrada de dados'!J118","v":-67678.205318647641},{"$f":"'(4) Entrada de dados'!K118","v":-54149.280884310137},{"$f":"'(4) Entrada de dados'!L118","v":-40620.356449972627},{"$f":"'(4) Entrada de dados'!M118","v":-27091.432015635117},{"$f":"'(4) Entrada de dados'!N118","v":-13562.507581297603},{"$f":"'(4) Entrada de dados'!O118","v":-33.583146960096201}]
[null,null,null,null,null,null,0.12000000000000001,{"$f":"'(4) Entrada de dados'!F119","v":-111284.42547042362},{"$f":"'(4) Entrada de dados'!G119","v":-99569.73556383379},{"$f":"'(4) Entrada de dados'!H119","v":-87855.045657243958},{"$f":"'(4) Entrada de dados'!I119","v":-76140.355750654126},{"$f":"'(4) Entrada de dados'!J119","v":-64425.665844064279},{"$f":"'(4) Entrada de dados'!K119","v":-52710.975937474446},{"$f":"'(4) Entrada de dados'!L119","v":-40996.286030884614},{"$f":"'(4) Entrada de dados'!M119","v":-29281.596124294778},{"$f":"'(4) Entrada de dados'!N119","v":-17566.906217704945},{"$f":"'(4) Entrada de dados'!O119","v":-5852.2163111151167}]
[null,null,null,null,null,null,0.14000000000000001,{"$f":"'(4) Entrada de dados'!F120","v":-102720.69801013124},{"$f":"'(4) Entrada de dados'!G120","v":-92473.21880847172},{"$f":"'(4) Entrada de dados'!H120","v":-82225.739606812189},{"$f":"'(4) Entrada de dados'!I120","v":-71978.260405152658},{"$f":"'(4) Entrada de dados'!J120","v":-61730.781203493141},{"$f":"'(4) Entrada de dados'!K120","v":-51483.302001833617},{"$f":"'(4) Entrada de dados'!L120","v":-41235.822800174101},{"$f":"'(4) Entrada de dados'!M120","v":-30988.343598514577},{"$f":"'(4) Entrada de dados'!N120","v":-20740.864396855053},{"$f":"'(4) Entrada de dados'!O120","v":-10493.385195195529}]
[null,null,null,null,null,null,0.16,{"$f":"'(4) Entrada de dados'!F121","v":-95665.564658523755},{"$f":"'(4) Entrada de dados'!G121","v":-86618.636082688798},{"$f":"'(4) Entrada de dados'!H121","v":-77571.70750685384},{"$f":"'(4) Entrada de dados'!I121","v":-68524.778931018867},{"$f":"'(4) Entrada de dados'!J121","v":-59477.850355183909},{"$f":"'(4) Entrada de dados'!K121","v":-50430.921779348937},{"$f":"'(4) Entrada de dados'!L121","v":-41383.993203513979},{"$f":"'(4) Entrada de dados'!M121","v":-32337.06462767901},{"$f":"'(4) Entrada de dados'!N121","v":-23290.136051844049},{"$f":"'(4) Entrada de dados'!O121","v":-14243.207476009076}]
[null,null,null,null,null,null,0.18,{"$f":"'(4) Entrada de dados'!F122","v":-89792.499276930859},{"$f":"'(4) Entrada de dados'!G122","v":-81738.859730476659},{"$f":"'(4) Entrada de dados'!H122","v":-73685.220184022444},{"$f":"'(4) Entrada de dados'!I122","v":-65631.5806375682},{"$f":"'(4) Entrada de dados'!J122","v":-57577.941091114},{"$f":"'(4) Entrada de dados'!K122","v":-49524.301544659778},{"$f":"'(4) Entrada de dados'!L122","v":-41470.661998205564},{"$f":"'(4) Entrada de dados'!M122","v":-33417.022451751342},{"$f":"'(4) Entrada de dados'!N122","v":-25363.382905297127},{"$f":"'(4) Entrada de dados'!O122","v":-17309.743358842908}]